{"text_format":"1","workbook":"xlsx","n_sheets":10,"sheets":["Startseite","Würfe","Allgemeines","Einnahmen","Ausgaben","Unterhalt","Bilanz","Tabellen","Census","Modul1"],"not_rendered":{"charts":0,"images":1,"macros":1,"external_links":1,"defined_names":151,"comments":6,"pivot_tables":0},"unopened":[],"bounds":{"document_bytes":16777216,"sheet_cells":100000,"rows_first":2000,"rows_last":500,"rows_between":2000,"halvings":0,"cell_chars":16384,"cell_head_chars":4096},"cells_cut":0,"cells_raw":0,"read":"whole","date_system":"1900"}

{"sheet":"Startseite","index":0,"n_rows":54,"n_cols":4,"rows_kept":54,"cut":false,"hidden":false,"merged":[]}
[]
[null,null,null,"Hilfe zur Berechnung von Einkommen und Ausgaben eines"]
[null,null,null,"nordmärkischen Lehens"]
[]
[]
[]
[]
[]
[]
[]
[]
[]
[]
[]
[]
[]
[]
[]
[]
[]
[]
[]
[]
[]
[null,null,null,"aktualisierte Version nach dem Hoftag 1028 BF / 35 Hal"]
[]
[]
[]
[]
[]
["Stand: 2.3"]
["pruscht by Dennis F."]
["befreit von Frank W."]
[]
["1.6 -> 2.0","2020-07-14"]
[null,"- Formatierungen angepasst"]
[null,"- Makro entfernt"]
[null,"- Tabelle \"Würfe\" überprüft, Fehler beseitigt"]
[null,"- Tabelle \"Würfe\" neu organisiert"]
[null,"- Alle Parameter sind im Tabellenblatt \"Tabellen\" anpassbar"]
[null,"- Rundung auf ganze Personen"]
[null,"- Rundung von Beträgen einstellbar (D -> K)"]
[null,"- Bei Verwendung der Census-Daten Berechnung des Bauernanteils unter Berücksichtigung der Zwerge"]
[null,"- Anpassungen einiger Berechnungen an die Vorlage"]
[]
["1.6 -> 2.1","2020-07-19"]
[null,"- Makro für die automatische Würfelberechnung"]
[]
["2.1 -> 2.2","2020-07-25"]
[null,"- Anpassung einiger Begriffe an die nordmärkischen Vorgaben"]
[null,"- Einbau von Edlengütern"]
[]
["2.2 -> 2.3","2020-08-02"]
[null,"- Neuberechnug der Ausgaben: Der Herzogentaler verringert die Einahmen, danach werden die Zehnte berechnet."]

{"sheet":"Würfe","index":1,"n_rows":37,"n_cols":6,"rows_kept":37,"cut":false,"hidden":false,"merged":[]}
[]
[]
[]
[null,null,null,null,"Hier sind vorab ein paar Würfelwürfe zu tätigen. Die Ergebnisse werden in der"]
[null,null,null,null,"späteren Berechnung gebraucht. Würfelt einfach und tragt die Ergebnisse der Reihe nach hier ein :"]
[]
[]
[null,null,"Würfel (W3)",3,"Würfel (W3)",1]
[null,null,"Würfel (W3)",2,"Würfel (W3)",1]
[]
[null,null,"Würfel (W6)",3,"Würfel (W6)",5]
[null,null,"Würfel (W6)",3]
[]
[null,null,"Würfel (W10)",8,"Würfel (W10)",9]
[null,null,"Würfel (W10)",8,"Würfel (W10)",1]
[]
[null,null,"Würfel (W20)",9,"Würfel (W20)",18]
[null,null,"Würfel (W20)",16,"Würfel (W20)",8]
[null,null,"Würfel (W20)",20,"Würfel (W20)",18]
[null,null,"Würfel (W20)",2,"Würfel (W20)",19]
[null,null,"Würfel (W20)",8,"Würfel (W20)",11]
[null,null,"Würfel (W20)",16,"Würfel (W20)",2]
[null,null,"Würfel (W20)",12,"Würfel (W20)",10]
[null,null,"Würfel (W20)",6,"Würfel (W20)",13]
[null,null,"Würfel (W20)",13,"Würfel (W20)",6]
[null,null,"Würfel (W20)",6,"Würfel (W20)",17]
[null,null,"Würfel (W20)",17,"Würfel (W20)",12]
[null,null,"Würfel (W20)",20]
[]
[]
[null,null,null,"Zur Erklärung der folgenden Tabellen:"]
[]
[null,null,null,null,"Diese Felder sind Berechnungsfelder"]
[]
[null,null,null,null,"In diese Felder sollen Spielerangaben gemacht werden"]
[]
[null,null,null,null,"Das hier sind Ergebnisfelder"]

{"sheet":"Allgemeines","index":2,"n_rows":43,"n_cols":7,"rows_kept":43,"cut":false,"hidden":false,"merged":[]}
[]
[null,"I. Allgemeines :"]
[]
[null,"Name der Lehens:",null,null,null,null,{"$f":"IF(_JN_Census=1,IFERROR(VLOOKUP(_Nr&\"*\",_CensusTab,2,FALSE),\"\"),\"\")","v":""}]
[null,"Kennziffer :"]
[null,"Lehensträger:",null,null,null,null,{"$f":"IF(_JN_Census=1,IFERROR(VLOOKUP(_Nr&\"*\",_CensusTab,3,FALSE),\"\"),\"\")","v":""}]
[null,null,"TaW Staatskunst:"]
[null,null,"TaW Feilschen:"]
[null,null,"TaW Rechnen:"]
[]
[null,"Daten aus dem Census verwenden?",null,2,null,null,"Hinweis :"]
[]
[null,"Handelt es sich um ein Edlen-, Junkergut, o.ä.?",null,2,null,null,"Im Feld Bevölkerungszahl erscheint die"]
[null,null,null,null,null,null,"nach den Regeln korrekt errechnete"]
[null,"Stadt > 1000 Einwohner im Lehen?",null,2,null,null,"Bevölkerung Eures Lehens, es kann "]
[null,"Stadt > 4000 Einwohner im Lehen?",null,2,null,null,"jedoch sein das die Zahl einem Baron"]
[null,"Schiffbarer Fluss oder See im Lehen?",null,2,null,null,"zu hoch ist. In diesem Fall ist die "]
[null,"Führt eine Reichsstrasse durch das Lehen?",null,2,null,null,"errechnete Zahl die maximal Ober-"]
[null,"Führt eine wichtige Passstrasse durch das Lehen?",null,2,null,null,"grenze und darf nach unten, aber "]
[null,"Liegt das Lehen an einer Provinzgrenze?",null,2,null,null,"nur nach unten angepaßt werden!"]
[]
[null,"geographische Region:  ",null,1,null,null,"Alternativ können die Zahlen aus dem"]
[null,"Zwischensumme:",null,{"$f":"IF(_JN_Census=1,\"\",ROUND(INDEX(_EinwReg_NM,_RegionDD)*CHOOSE(_JN_Edle,_EinwohnerEdle,1),0))","v":1500},null,null,"Census ausgewählt werden, diese"]
[null,"Besiedlungstyp :",null,1,null,null,"werden nicht modifiziert!"]
[null,"Zwischensumme:",null,{"$f":"IF(_JN_Census=1,\"\",ROUND((_EinwohnerZS1+INDEX(_BesiedTypAusw,_BesiedDD)*CHOOSE(_JN_Edle,_EinwohnerEdle,1))*(1+INDEX(_EinwohnerMod,_BesiedDD,_W06_1)),0))","v":1500},null,null,"Es muss aber für die korrekten Ein-"]
[null,"Zu-/Abschläge von der Kanzlei",null,null,null,null,"nahmen der Besiedlungstyp richtig"]
[null,null,null,null,null,null,"gewählt werden!"]
[null,"Bevölkerungszahl:",null,{"$f":"IF(_JN_Census=1, IFERROR(VLOOKUP(_Nr&\"*\",_CensusTab,6,FALSE),0),_EinwohnerZS2+_EinwohnerKanzl)","v":1500},"Einw."]
[]
[null,"Davon Bauern :",null,{"$f":"IFERROR(ROUND(_Einwohner*_BauernAnteil,0),0)","v":1200},"Einw."]
[]
[null,"Die Bauern verteilen sich wie folgt :"]
[null,"Art:","Im Lehen vorhanden:","Anzahl Bewohner :"]
[1,"Kleiner Hof:",{"$f":"ROUND(_BauerKl/INDEX(_Hoftyp,7,A34),0)","v":48},{"$f":"_AnzBauern-_BauerMi-_BauerGr-_BauerGu-_BauerHi-_BauerWa","v":480},"Einw."]
[2,"Mittlerer Hof:",{"$f":"ROUND(_BauerMi/INDEX(_Hoftyp,7,A35),0)","v":9},{"$f":"ROUND(_AnzBauern*INDEX(_Hoftyp,_BesiedDD,A35),0)","v":180},"Einw."]
[3,"Großer Hof:",{"$f":"ROUND(_BauerGr/INDEX(_Hoftyp,7,A36),0)","v":2},{"$f":"ROUND(_AnzBauern*INDEX(_Hoftyp,_BesiedDD,A36),0)","v":60},"Einw."]
[4,"Gutshof:",{"$f":"ROUND(_BauerGu/INDEX(_Hoftyp,7,A37),0)","v":1},{"$f":"ROUND(_AnzBauern*INDEX(_Hoftyp,_BesiedDD,A37),0)","v":36},"Einw."]
[5,"Hirtenstellen:",{"$f":"ROUND(_BauerHi/INDEX(_Hoftyp,7,A38),0)","v":30},{"$f":"ROUND(_AnzBauern*INDEX(_Hoftyp,_BesiedDD,A38),0)","v":300},"Einw."]
[6,"Waldbauernhof:",{"$f":"ROUND(_BauerWa/INDEX(_Hoftyp,7,A39),0)","v":14},{"$f":"ROUND(_AnzBauern*INDEX(_Hoftyp,_BesiedDD,A39),0)","v":144},"Einw."]
[null,"Kontrolle :",null,{"$f":"SUM(D34:D39)","v":1200},"Einw."]
[]
[null,"Hat der Lehenträger das Lehen unterbelehnt :"]
[null,"Anzahl der Edlengüter im Lehen:",null,1]

{"sheet":"Einnahmen","index":3,"n_rows":24,"n_cols":7,"rows_kept":24,"cut":false,"hidden":false,"merged":[]}
[]
[null,"II. Einnahmen pro Jahr in Dukaten:"]
[]
[null,"a:",null,null,"e:"]
[null,"Erträge der Höfe:",null,null,"Einkünfte der eigenen Domäne:"]
[1,"Kleiner Hof:",{"$f":"_AnzBauerKl*INDEX(_Hoftyp,9,A6)","v":720},null,null,null,{"$f":"ROUND((_Einwohner/10-(_AnzEdel-1)*50)*(_W03_1+4),_RundGeld)","v":1050}]
[2,"Mittlerer Hof:",{"$f":"_AnzBauerMi*INDEX(_Hoftyp,9,A7)","v":540}]
[3,"Großer Hof:",{"$f":"_AnzBauerGr*INDEX(_Hoftyp,9,A8)","v":300}]
[4,"Gutshof:",{"$f":"_AnzBauerGu*INDEX(_Hoftyp,9,A9)","v":300},null,"f:"]
[5,"Hirtenstellen:",{"$f":"_AnzBauerHi*INDEX(_Hoftyp,9,A10)","v":600},null,"Bannergeld:"]
[6,"Waldbauernhof:",{"$f":"_AnzBauerWa*INDEX(_Hoftyp,9,A11)","v":980},null,null,null,{"$f":"CHOOSE(_JN_Edle,0,ROUND((_Einwohner*2%+_AnzBauerGr+_AnzBauerGu)*4,_RundGeld))","v":132}]
[null,null,{"$f":"SUM(C6:C11)","v":3440}]
[]
[null,"b:",null,null,"g:"]
[null,"Das Sterbegeld:",null,null,"Sonstige Steuern:"]
[null,null,{"$f":"ROUND(_Einwohner/100*(_W20_1+_W20_2+_W20_3),_RundGeld)","v":645},null,null,null,{"$f":"ROUND(_X_Faktor*CHOOSE(_JN_Edle,0.5,1)*_Einwohner*(100%-90%*_BauernAnteil)+(_TaW_Sk+_TaW_Feil+_TaW_Rechn)*(_W06_2+1)*10,_RundGeld)","v":420}]
[]
[null,"c:",null,null,"h:"]
[null,"Weingeld:",null,null,"Zölle wenn Lehen an Provinzgrenze:"]
[null,null,{"$f":"ROUND(_Einwohner/100*(_W20_4+_W20_5),_RundGeld)","v":420},null,null,null,{"$f":"CHOOSE(_JN_Edle,0,ROUND(_X_Zoll*_Einwohner*(100%-90%*_BauernAnteil),_RundGeld))","v":0}]
[]
[null,"d:"]
[null,"Das Schongeld:",null,null,"Gesamte Einnahmen der Baronie"]
[null,null,{"$f":"ROUND(_Einwohner/100*_W20_6,_RundGeld)","v":270},null,{"$f":"_EinahmeBauer+_EinnahmeSterb+_EinnahmeWein+_EinnahmeSchon+_EinnahmeDom+_EinnahmeWehr+_EinnahmeSonst+_EinnahmeZoll","v":6377},"Dukaten"]

{"sheet":"Ausgaben","index":4,"n_rows":19,"n_cols":8,"rows_kept":19,"cut":false,"hidden":false,"merged":[]}
[]
[null,"III. Feste Ausgaben des Lehens pro Jahr in Dukaten:"]
[]
[null,"a.",null,null,null,"d."]
[null,"Der Herzogentaler:",null,null,null,"Tempelzehnt:"]
[null,"(Einwohnerbasiert)",null,{"$f":"CHOOSE(_JN_Edle,0,ROUND(_Einwohner*_Herzogentaler,_RundGeld))","v":1950},null,null,null,{"$f":"ROUND(_Einnahmen*_ZehntTemp,_RundGeld)","v":638}]
[]
[]
[null,"b.",null,null,null,"e."]
[null,"Lehensabgaben:",null,null,null,"Kredite:"]
[null,"Grafenzehnt:",null,{"$f":"ROUND(_Einnahmen*_ZehntGraf*CHOOSE(_JN_Edle,2,1),_RundGeld)","v":638},null,"Abtragung :"]
[null,"Herzogenzehnt:",null,{"$f":"ROUND(_Einnahmen*_ZehntHerz*CHOOSE(_JN_Edle,2,1),_RundGeld)","v":638}]
[null,null,null,{"$f":"SUM(D11:D12)","v":1276}]
[]
[null,"c."]
[null,"Zollabgaben:"]
[null,"Grafenanteil:",null,{"$f":"ROUND(_EinnahmeZoll*_ZollGraf,_RundGeld)","v":0},null,"Summe der festen Ausgaben"]
[null,"Herzogenanteil:",null,{"$f":"ROUND(_EinnahmeZoll*_ZollHerz,_RundGeld)","v":0},null,{"$f":"_AusgabeHerz+_AusgabeLehen+_AusgabeZoll+_AusgabeTemp+_AusgabeKredit","v":3864},"Dukaten"]
[null,null,null,{"$f":"SUM(D17:D18)","v":0}]

{"sheet":"Unterhalt","index":5,"n_rows":54,"n_cols":8,"rows_kept":54,"cut":false,"hidden":false,"merged":[]}
[]
[null,"IV. laufende Unterhaltung des Lehens"]
[]
[null,"a.",null,null,null,"b."]
[null,"Burgen:","Anzahl:","Unterhaltung:",null,"Straßen:","Anzahl Meilen: ","Unterhaltung:"]
[1,"große Burg",1,{"$f":"ROUND((_AnzGrBurg-1)*INDEX(_UnterhaltListe,$A6)*_W03_2/10,_RundGeld)","v":0},null,"Reichsstraße",null,{"$f":"ROUND((_W20_7+_W20_8+_W20_9+_W20_10)*_MeileRS/10,_RundGeld)","v":0}]
[2,"mittlere Burg",1,{"$f":"ROUND((_AnzMiBurg-1)*INDEX(_UnterhaltListe,$A7)*_W03_2/10,_RundGeld)","v":0},null,"Hauptstraße",null,{"$f":"ROUND((_W20_11+_W20_12)*_MeileHS/10,_RundGeld)","v":0}]
[3,"kleine Burg",1,{"$f":"ROUND((_AnzKlBurg-1)*INDEX(_UnterhaltListe,$A8)*_W03_2/10,_RundGeld)","v":0},null,"Nebenwege",null,{"$f":"ROUND((_W20_13)*_MeileNW/10,_RundGeld)","v":0}]
[null,null,null,{"$f":"SUM(D6:D8)","v":0},null,"Karrenwege",null,{"$f":"ROUND((_W10_1)*_MeileKW/10,_RundGeld)","v":0}]
[null,null,null,null,null,null,null,{"$f":"SUM(H6:H9)","v":0}]
[]
[null,"c.",null,null,null,"d."]
[null,"Brücken:","Anzahl Schritt:","Unterhaltung:",null,"restliche Infrastruktur :"]
[null,"Holzbrücke",null,{"$f":"ROUND((_W10_2+_W10_3)*_SchrittHBrü/10,_RundGeld)","v":0},null,null,null,{"$f":"INDEX(_InfraListe,_BesiedDD)","v":204}]
[null,"Steinrücke",null,{"$f":"ROUND((_W20_14+_W20_15)*_SchrittSBrü/10,_RundGeld)","v":0}]
[null,"Fährschloß",null,{"$f":"ROUND((_W20_16+_W20_17)*_SchrittFährSchl/10,_RundGeld)","v":0},null,"e."]
[null,"Fährschiff",null,{"$f":"ROUND((_W20_18+_W20_19+_W20_20)*_SchrittFähre/10,_RundGeld)","v":0},null,"Dotierungen:"]
[null,null,null,{"$f":"SUM(D14:D17)","v":0},null,null,null,{"$f":"ROUND(_Einwohner/10*_W03_4,_RundGeld)","v":150}]
[]
[null,"f."]
[null,"Kosten für Personal:"]
[null,"Art :",null,"Anzahl: ",null,"Zusatzzahlungen:","Kosten:"]
[4,"Verwalter, Hauptmann der Miliz, Hofmagus",null,1,null,null,{"$f":"ROUND((_AnzP1-1)*INDEX(_UnterhaltListe,$A23)+F23,_RundGeld)","v":0}]
[5,"Haushofmeister, Wundarzt, Feldscher, Hauslehrer",null,1,null,null,{"$f":"ROUND((_AnzP2-1)*INDEX(_UnterhaltListe,$A24)+F24,_RundGeld)","v":0}]
[6,"Waibel, Schreiber, Sekretär, Koch, Falkner",null,1,null,null,{"$f":"ROUND((_AnzP3-1)*INDEX(_UnterhaltListe,$A25)+F25,_RundGeld)","v":0}]
[7,"Korporal, Jagdmeister, Stall- und Feldaufseher",null,1,null,null,{"$f":"ROUND((_AnzP4-1)*INDEX(_UnterhaltListe,$A26)+F26,_RundGeld)","v":0}]
[8,"Büttel, Zöllner, Zofe, Diener",null,1,null,null,{"$f":"ROUND((_AnzP5-1)*INDEX(_UnterhaltListe,$A27)+F27,_RundGeld)","v":0}]
[9,"Reitknecht",null,1,null,null,{"$f":"ROUND((_AnzP6-1)*INDEX(_UnterhaltListe,$A28)+F28,_RundGeld)","v":0}]
[10,"Page",null,1,null,null,{"$f":"ROUND((_AnzP7-1)*INDEX(_UnterhaltListe,$A29)+F29,_RundGeld)","v":0}]
[null,"Nicht aufgeführte Berufe",null,"Anzahl:","Kosten pro Person:","Zusatzzahlungen:"]
[null,null,null,1,null,null,{"$f":"ROUND((_AnzP8-1)*E31+F31,_RundGeld)","v":0}]
[null,null,null,1,null,null,{"$f":"ROUND((_AnzP9-1)*E32+F32,_RundGeld)","v":0}]
[null,null,null,1,null,null,{"$f":"ROUND((_AnzP10-1)*E33+F33,_RundGeld)","v":0}]
[null,null,null,null,null,null,{"$f":"SUM(G23:G33)","v":0}]
[null,"g."]
[null,"Kosten für Tiere:"]
[null,"Art :",null,"Anzahl: ",null,"Zusatzzahlungen:","Kosten:"]
[11,"Pferd (Warunker)",null,1,null,null,{"$f":"ROUND((_AnzT1-1)*INDEX(_UnterhaltListe,$A38)+F38,_RundGeld)","v":0}]
[12,"Pferd (Elenviner Vollblut)",null,1,null,null,{"$f":"ROUND((_AnzT2-1)*INDEX(_UnterhaltListe,$A39)+F39,_RundGeld)","v":0}]
[13,"Zugochse",null,1,null,null,{"$f":"ROUND((_AnzT3-1)*INDEX(_UnterhaltListe,$A40)+F40,_RundGeld)","v":0}]
[14,"Maultier",null,1,null,null,{"$f":"ROUND((_AnzT4-1)*INDEX(_UnterhaltListe,$A41)+F41,_RundGeld)","v":0}]
[15,"Muli",null,1,null,null,{"$f":"ROUND((_AnzT5-1)*INDEX(_UnterhaltListe,$A42)+F42,_RundGeld)","v":0}]
[16,"Esel",null,1,null,null,{"$f":"ROUND((_AnzT6-1)*INDEX(_UnterhaltListe,$A43)+F43,_RundGeld)","v":0}]
[17,"Wehrheimer Dogge",null,1,null,null,{"$f":"ROUND((_AnzT7-1)*INDEX(_UnterhaltListe,$A44)+F44,_RundGeld)","v":0}]
[18,"ThorwalerWindhund",null,1,null,null,{"$f":"ROUND((_AnzT8-1)*INDEX(_UnterhaltListe,$A45)+F45,_RundGeld)","v":0}]
[null,"Nicht aufgeführte Tiere:",null,"Anzahl:","Kosten pro Tier:","Zusatzzahlungen:"]
[null,null,null,1,null,null,{"$f":"ROUND((_AnzT9-1)*E47+F47,_RundGeld)","v":0}]
[null,null,null,1,null,null,{"$f":"ROUND((_AnzT10-1)*E48+F48,_RundGeld)","v":0}]
[null,null,null,1,null,null,{"$f":"ROUND((_AnzT11-1)*E49+F49,_RundGeld)","v":0}]
[null,null,null,null,null,null,{"$f":"SUM(G38:G49)","v":0}]
[]
[]
[null,null,null,"Summe der Unterhaltskosten und Löhne:"]
[null,null,null,{"$f":"_UntBurgen+_UntStr+_UntBrück+_UntInfra+_UntDot+_UntPerso+_UntTier","v":354},"Dukaten"]

{"sheet":"Bilanz","index":6,"n_rows":24,"n_cols":7,"rows_kept":24,"cut":false,"hidden":false,"merged":[]}
[]
[null,"V. Die Abschlußbilanz"]
[]
[null,null,"Einkünfte:",{"$f":"_Einnahmen","v":6377},"Dukaten"]
[null,"-","Ausgaben:",{"$f":"_Ausgaben","v":3864},"Dukaten"]
[null,"-","Unterhalt:",{"$f":"_Unterhalt","v":354},"Dukaten"]
[]
[null,null,"Zwischenergebnbis:",{"$f":"D4-D5-D6","v":2159},"Dukaten"]
[]
[null,"-","Rücklage",null,"Dukaten"]
[null,"-","Investitionen",null,"Dukaten"]
[null,"-","Privatschatulle",null,"Dukaten"]
[]
[null,"+","Kredit",null,"Dukaten"]
[null,"+","Entnahme aus Rücklage",null,"Dukaten"]
[]
[null,null,"Ergebnis :",{"$f":"D8-D10-D11-D12+D14+D15","v":2159},"Dukaten",null,{"$f":"IF(D17<>0,\"Achtung! Die Bilanz muss auf 0 aufgehen!\",\"\")","v":"Achtung! Die Bilanz muss auf 0 aufgehen!"}]
[]
[]
[]
[]
[null,"Stand der Rücklage :",null,null,"Dukaten"]
[]
[null,"Kreditverpflichtungen:",null,null,"Dukaten"]

{"sheet":"Tabellen","index":7,"n_rows":36,"n_cols":39,"rows_kept":36,"cut":false,"hidden":false,"merged":[[0,19,1,19],[0,20,0,23],[0,24,1,24],[0,31,1,31],[0,33,0,36],[0,0,1,0],[0,27,0,29],[0,30,1,30],[0,6,0,11],[0,1,1,1],[0,2,1,2],[0,3,1,3],[0,4,1,4],[0,5,1,5],[0,25,0,26],[0,12,1,12],[0,13,0,18]]}
["Ja/Nein","Würfel","Region","Einwohner/Region","Besiedlungstyp","Auswirkungen Besiedlungstyp","Modifikation Einwohner (_W06_1)",null,null,null,null,null,"Anteil Bauern","Anteil Hoftyp",null,null,null,null,null,"Nachkomma Geld","Nachbarschaft",null,null,null,"Herzogen-taler (D)","Zehnte",null,"Unterhalt",null,null,"Infrastruktur","Einwohner Edlengut",null,"Beschreibung der Würfel",null,null,null,null,"Neu anzeigen?"]
[null,null,null,null,null,null,1,2,3,4,5,6,null,"Klein","Mittel","Groß","Gut","Hirten","Waldbauer",null,"Bedingung","Wert","Faktor","Ergebnis",null,"Typ","Wert","Index","Typ","Wert",null,null,null,"Würfel","akt. Wert","Formel","Zelle",null,false]
["ja",0,"Nördliches Gratenfels",1500,"Ödlande",0,0.1,0.05,0,-0.1,-0.2,-0.3,{"$f":"M5*(100%-M7)","v":0.8},0.4,0.15,0.05,0.03,0.25,0.12,0,"Basiswert",null,1,{"$f":"1","v":1},1.3,"Grafenzehnt",0.1,1,"große Burg",15000,{"$f":"_W20_21*_W20_22","v":204},0.1,null,"_W03_1",{"$f":"_W03_1","v":3},"III.E","Einnahmen'!$G$6"]
["nein",1,"Rest der Nordmarken",3800,"Wildlande",200,0.15,0.05,0,0,-0.05,-0.15,"Vorgabe",0.4,0.15,7.0000000000000007E-2,0.04,0.14000000000000001,0.2,null,"Stadt > 1000",{"$f":"_JN_1000=1","v":false},0.5,{"$f":"IF(V4,W4,0)","v":0},null,"Herzogenzehnt",0.1,2,"mittlere Burg",8000,{"$f":"_W20_21*(_W20_22+_W10_4)","v":221},null,null,"_W03_2",{"$f":"_W03_2","v":1},"V.A","Unterhalt'!$K$6"]
[null,2,null,null,"Grenzungen",400,0.2,0.1,0,0,-0.05,-0.1,0.8,0.35,0.23,0.1,0.05,0.12,0.15,null,"Stadt > 4000",{"$f":"_JN_4000=1","v":false},1,0,null,"Tempelzehnt",0.1,3,"kleine Burg",4000,{"$f":"_W20_21*(_W20_22+_W20_23)","v":544},null,null,"_W03_3",{"$f":"_W03_3","v":2},"V.C","_InfraListe"]
[null,3,"Nördliche Baronien",1500,"Mischlande",600,0.2,0.15,0.1,0,0,-0.1,"Anteil Zw.",0.3,0.3,0.15,7.0000000000000007E-2,0.1,0.08,null,"Fluss/See",{"$f":"_JN_Fluss=1","v":false},0.5,0,null,"Grafenanteil Zoll",0.25,4,"Verwalter",250,{"$f":"_W20_21*(_W20_22+_W20_23+_W10_4)","v":561},null,null,"_W03_4",{"$f":"_W03_4","v":1},"V.E","Unterhalt'!$H$18"]
[null,4,"Mittelländische Baronien",3800,"Wohlpflegende",800,0.25,0.15,0.1,0.05,0,-0.1,{"$f":"IF(_JN_Census=1,IFERROR(VLOOKUP(_Nr&\"*\",_CensusTab,7,FALSE),0),0)","v":0},0.3,0.3,0.2,0.1,0.05,0.05,null,"Besiedlungstyp",{"$f":"_BesiedDD>=5","v":false},0.5,0,null,"Herzogenanteil Zoll",0.25,5,"Haushofmeister",150,{"$f":"_W20_21*(+_W20_22+_W20_23)*_W03_3","v":1088},null,null,"_W06_1",{"$f":"_W06_1","v":3},"II.C","Allgemeines'!$D$23"]
[null,5,"Südliche Baronien",5000,"Kulturlande",1000,0.3,0.2,0.1,0.05,0,-0.05,null,0.3,0.25,0.25,0.15,0.05,0,null,"Reichsstr.",{"$f":"_JN_Reich=1","v":false},0.5,0,null,null,null,6,"Waibel",120,{"$f":"_W20_21*(+_W20_22+_W20_23)*_W06_3","v":1632},null,null,"_W06_2",{"$f":"_W06_2","v":5},"III.G","Einnahmen'!$G$16"]
[null,6,null,null,null,null,null,null,null,null,null,null,"Bewohner",10,20,30,40,10,10,null,"Passstr.",{"$f":"_JN_Pass=1","v":false},0.5,0,null,null,null,7,"Korporal",80,null,null,null,"_W06_3",{"$f":"_W06_3","v":3},"V.C","_InfraListe"]
[null,7,null,null,null,null,null,null,null,null,null,null,"Land",4,20,70,120,3,3,null,null,null,"X:",{"$f":"SUM(X3:X9)","v":1},null,null,null,8,"Büttel",60,null,null,null,"_W10_1",{"$f":"_W10_1","v":8},"V.B","Unterhalt'!$H$9"]
[null,8,null,null,null,null,null,null,null,null,null,null,"Einnahmen",15,60,150,300,20,70,null,"Grenze",{"$f":"_JN_Grenze=1","v":false},0.5,{"$f":"IF(V11,W11,0)","v":0},null,null,null,9,"Reitknecht",50,null,null,null,"_W10_2",{"$f":"_W10_2","v":9},"V.B","Unterhalt'!$D$14"]
[null,9,null,null,null,null,null,null,null,null,null,null,null,null,null,null,null,null,null,null,null,null,null,null,null,null,null,10,"Page",30,null,null,null,"_W10_3",{"$f":"_W10_3","v":8},"V.B","Unterhalt'!$D$14"]
[null,10,null,null,null,null,null,null,null,null,null,null,null,null,null,null,null,null,null,null,null,null,null,null,null,null,null,11,"Pferd (Warunker)",40,null,null,null,"_W10_4",{"$f":"_W10_4","v":1},"V.C","_InfraListe"]
[null,11,null,null,null,null,null,null,null,null,null,null,null,null,null,null,null,null,null,null,null,null,null,null,null,null,null,12,"Pferd (Elenviner Vollblut)",80,null,null,null,"_W20_1",{"$f":"_W20_1","v":9},"III.B","Einnahmen'!$C$16"]
[null,12,null,null,null,null,null,null,null,null,null,null,null,null,null,null,null,null,null,null,null,null,null,null,null,null,null,13,"Zugochse",25,null,null,null,"_W20_2",{"$f":"_W20_2","v":18},"III.B","Einnahmen'!$C$16"]
[null,13,null,null,null,null,null,null,null,null,null,null,null,null,null,null,null,null,null,null,null,null,null,null,null,null,null,14,"Maultier",15,null,null,null,"_W20_3",{"$f":"_W20_3","v":16},"III.B","Einnahmen'!$C$16"]
[null,14,null,null,null,null,null,null,null,null,null,null,null,null,null,null,null,null,null,null,null,null,null,null,null,null,null,15,"Muli",15,null,null,null,"_W20_4",{"$f":"_W20_4","v":8},"III.C","Einnahmen'!$C$20"]
[null,15,null,null,null,null,null,null,null,null,null,null,null,null,null,null,null,null,null,null,null,null,null,null,null,null,null,16,"Esel",10,null,null,null,"_W20_5",{"$f":"_W20_5","v":20},"III.C","Einnahmen'!$C$20"]
[null,16,null,null,null,null,null,null,null,null,null,null,null,null,null,null,null,null,null,null,null,null,null,null,null,null,null,17,"Wehrheimer Dogge",30,null,null,null,"_W20_6",{"$f":"_W20_6","v":18},"III.D","Einnahmen'!$C$24"]
[null,17,null,null,null,null,null,null,null,null,null,null,null,null,null,null,null,null,null,null,null,null,null,null,null,null,null,18,"ThorwalerWindhund",10,null,null,null,"_W20_7",{"$f":"_W20_7","v":2},"V.B","Unterhalt'!$H$6"]
[null,18,null,null,null,null,null,null,null,null,null,null,null,null,null,null,null,null,null,null,null,null,null,null,null,null,null,null,null,null,null,null,null,"_W20_8",{"$f":"_W20_8","v":19},"V.B","Unterhalt'!$H$6"]
[null,19,null,null,null,null,null,null,null,null,null,null,null,null,null,null,null,null,null,null,null,null,null,null,null,null,null,null,null,null,null,null,null,"_W20_9",{"$f":"_W20_9","v":8},"V.B","Unterhalt'!$H$6"]
[null,20,null,null,null,null,null,null,null,null,null,null,null,null,null,null,null,null,null,null,null,null,null,null,null,null,null,null,null,null,null,null,null,"_W20_10",{"$f":"_W20_10","v":11},"V.B","Unterhalt'!$H$6"]
[null,null,null,null,null,null,null,null,null,null,null,null,null,null,null,null,null,null,null,null,null,null,null,null,null,null,null,null,null,null,null,null,null,"_W20_11",{"$f":"_W20_11","v":16},"V.B","Unterhalt'!$H$7"]
[null,null,null,null,null,null,null,null,null,null,null,null,null,null,null,null,null,null,null,null,null,null,null,null,null,null,null,null,null,null,null,null,null,"_W20_12",{"$f":"_W20_12","v":2},"V.B","Unterhalt'!$H$7"]
[null,null,null,null,null,null,null,null,null,null,null,null,null,null,null,null,null,null,null,null,null,null,null,null,null,null,null,null,null,null,null,null,null,"_W20_13",{"$f":"_W20_13","v":12},"V.B","Unterhalt'!$H$8"]
[null,null,null,null,null,null,null,null,null,null,null,null,null,null,null,null,null,null,null,null,null,null,null,null,null,null,null,null,null,null,null,null,null,"_W20_14",{"$f":"_W20_14","v":10},"V.B","Unterhalt'!$D$15"]
[null,null,null,null,null,null,null,null,null,null,null,null,null,null,null,null,null,null,null,null,null,null,null,null,null,null,null,null,null,null,null,null,null,"_W20_15",{"$f":"_W20_15","v":6},"V.B","Unterhalt'!$D$15"]
[null,null,null,null,null,null,null,null,null,null,null,null,null,null,null,null,null,null,null,null,null,null,null,null,null,null,null,null,null,null,null,null,null,"_W20_16",{"$f":"_W20_16","v":13},"V.B","Unterhalt'!$D$16"]
[null,null,null,null,null,null,null,null,null,null,null,null,null,null,null,null,null,null,null,null,null,null,null,null,null,null,null,null,null,null,null,null,null,"_W20_17",{"$f":"_W20_17","v":13},"V.B","Unterhalt'!$D$16"]
[null,null,null,null,null,null,null,null,null,null,null,null,null,null,null,null,null,null,null,null,null,null,null,null,null,null,null,null,null,null,null,null,null,"_W20_18",{"$f":"_W20_18","v":6},"V.B","Unterhalt'!$D$17"]
[null,null,null,null,null,null,null,null,null,null,null,null,null,null,null,null,null,null,null,null,null,null,null,null,null,null,null,null,null,null,null,null,null,"_W20_19",{"$f":"_W20_19","v":6},"V.B","Unterhalt'!$D$17"]
[null,null,null,null,null,null,null,null,null,null,null,null,null,null,null,null,null,null,null,null,null,null,null,null,null,null,null,null,null,null,null,null,null,"_W20_20",{"$f":"_W20_20","v":17},"V.B","Unterhalt'!$D$17"]
[null,null,null,null,null,null,null,null,null,null,null,null,null,null,null,null,null,null,null,null,null,null,null,null,null,null,null,null,null,null,null,null,null,"_W20_21",{"$f":"_W20_21","v":17},"V.C","_InfraListe"]
[null,null,null,null,null,null,null,null,null,null,null,null,null,null,null,null,null,null,null,null,null,null,null,null,null,null,null,null,null,null,null,null,null,"_W20_22",{"$f":"_W20_22","v":12},"V.C","_InfraListe"]
[null,null,null,null,null,null,null,null,null,null,null,null,null,null,null,null,null,null,null,null,null,null,null,null,null,null,null,null,null,null,null,null,null,"_W20_23",{"$f":"_W20_23","v":20},"V.C","_InfraListe"]

{"sheet":"Census","index":8,"n_rows":329,"n_cols":9,"rows_kept":329,"cut":false,"hidden":false,"merged":[]}
["Formeln",{"$f":"IF(OR(A1=\"\",A1=\"-\"),\"\",IFERROR(VLOOKUP($A1,[1]Tabelle2!$A:$I,B$2,FALSE),\"\"))","v":""},{"$f":"IF(OR(B1=\"\",B1=\"-\"),\"\",IFERROR(VLOOKUP($A1,[1]Tabelle2!$A:$I,C$2,FALSE),\"\"))","v":""},{"$f":"IF(OR(C1=\"\",C1=\"-\"),\"\",IFERROR(VLOOKUP($A1,[1]Tabelle2!$A:$I,D$2,FALSE),\"\"))","v":""},{"$f":"IF(OR(D1=\"\",D1=\"-\"),\"\",IFERROR(VLOOKUP($A1,[1]Tabelle2!$A:$I,E$2,FALSE),\"\"))","v":""},{"$f":"IFERROR(D1+E1,\"\")","v":""},{"$f":"IFERROR(E1/F1,\"\")","v":""},null,"Stand: Census_Nordmarken_20200717b"]
[null,2,3,4,9]
["Nr.","Lehen","Lehensherr","Menschen","Zwerge","Gesamt","% Zwerge"]
["NOR  ",{"$f":"IF(OR(A4=\"\",A4=\"-\"),\"\",IFERROR(VLOOKUP($A4,[1]Tabelle2!$A:$I,B$2,FALSE),\"\"))","v":"Herzogtum Nordmarken"},{"$f":"IF(OR(B4=\"\",B4=\"-\"),\"\",IFERROR(VLOOKUP($A4,[1]Tabelle2!$A:$I,C$2,FALSE),\"\"))","v":"Herzog Hagrobald Guntwin vom Großen Fluß"},{"$f":"IF(OR(C4=\"\",C4=\"-\"),\"\",IFERROR(VLOOKUP($A4,[1]Tabelle2!$A:$I,D$2,FALSE),\"\"))","v":240000},{"$f":"IF(OR(D4=\"\",D4=\"-\"),\"\",IFERROR(VLOOKUP($A4,[1]Tabelle2!$A:$I,E$2,FALSE),\"\"))","v":10715},{"$f":"IFERROR(D4+E4,\"\")","v":250715},{"$f":"IFERROR(E4/F4,\"\")","v":4.2737769977863313E-2},null,"Hinweis :"]
["Nor-IP ",{"$f":"IF(OR(A5=\"\",A5=\"-\"),\"\",IFERROR(VLOOKUP($A5,[1]Tabelle2!$A:$I,B$2,FALSE),\"\"))","v":"Stadtmark Elenvina "},{"$f":"IF(OR(B5=\"\",B5=\"-\"),\"\",IFERROR(VLOOKUP($A5,[1]Tabelle2!$A:$I,C$2,FALSE),\"\"))","v":"Graf Frankwart vom Großen Fluß"},{"$f":"IF(OR(C5=\"\",C5=\"-\"),\"\",IFERROR(VLOOKUP($A5,[1]Tabelle2!$A:$I,D$2,FALSE),\"\"))","v":46000},{"$f":"IF(OR(D5=\"\",D5=\"-\"),\"\",IFERROR(VLOOKUP($A5,[1]Tabelle2!$A:$I,E$2,FALSE),\"\"))","v":500},46500,{"$f":"IFERROR(E5/F5,\"\")","v":1.0752688172043012E-2}]
["Nor-I-01",{"$f":"IF(OR(A6=\"\",A6=\"-\"),\"\",IFERROR(VLOOKUP($A6,[1]Tabelle2!$A:$I,B$2,FALSE),\"\"))","v":"Stadtmark Elenvina "},{"$f":"IF(OR(B6=\"\",B6=\"-\"),\"\",IFERROR(VLOOKUP($A6,[1]Tabelle2!$A:$I,C$2,FALSE),\"\"))","v":"Vogt Markward von Brüllenfels-Schleiffenröchte"},{"$f":"IF(OR(C6=\"\",C6=\"-\"),\"\",IFERROR(VLOOKUP($A6,[1]Tabelle2!$A:$I,D$2,FALSE),\"\"))","v":0},{"$f":"IF(OR(D6=\"\",D6=\"-\"),\"\",IFERROR(VLOOKUP($A6,[1]Tabelle2!$A:$I,E$2,FALSE),\"\"))","v":0},0,"",null,"Um nicht mit falschen Referenzen zu arbeiten, sind die Bezüge nur"]
["Nor-I-01P",{"$f":"IF(OR(A7=\"\",A7=\"-\"),\"\",IFERROR(VLOOKUP($A7,[1]Tabelle2!$A:$I,B$2,FALSE),\"\"))","v":"Ratslande Klippag"},{"$f":"IF(OR(B7=\"\",B7=\"-\"),\"\",IFERROR(VLOOKUP($A7,[1]Tabelle2!$A:$I,C$2,FALSE),\"\"))","v":"Baronin Idra ni Bennain von Elenvina, vertreten durch Ratsvogt Radulf von Elenvina"},{"$f":"IF(OR(C7=\"\",C7=\"-\"),\"\",IFERROR(VLOOKUP($A7,[1]Tabelle2!$A:$I,D$2,FALSE),\"\"))","v":30100},{"$f":"IF(OR(D7=\"\",D7=\"-\"),\"\",IFERROR(VLOOKUP($A7,[1]Tabelle2!$A:$I,E$2,FALSE),\"\"))","v":200},30300,6.6006600660066007E-3,null,"Werte."]
["Nor-I-01-1P",{"$f":"IF(OR(A8=\"\",A8=\"-\"),\"\",IFERROR(VLOOKUP($A8,[1]Tabelle2!$A:$I,B$2,FALSE),\"\"))","v":"Herzogenstadt Elenvina"},{"$f":"IF(OR(B8=\"\",B8=\"-\"),\"\",IFERROR(VLOOKUP($A8,[1]Tabelle2!$A:$I,C$2,FALSE),\"\"))","v":"Herzog Hagrobald Guntwin vom Großen Flußvertreten, vertreten durch Vogt Ardo von Plötzbogen"},{"$f":"IF(OR(C8=\"\",C8=\"-\"),\"\",IFERROR(VLOOKUP($A8,[1]Tabelle2!$A:$I,D$2,FALSE),\"\"))","v":12300},{"$f":"IF(OR(D8=\"\",D8=\"-\"),\"\",IFERROR(VLOOKUP($A8,[1]Tabelle2!$A:$I,E$2,FALSE),\"\"))","v":200},12500,1.6E-2,null,"Zur Aktualisierung:"]
["Nor-I-01-P2",{"$f":"IF(OR(A9=\"\",A9=\"-\"),\"\",IFERROR(VLOOKUP($A9,[1]Tabelle2!$A:$I,B$2,FALSE),\"\"))","v":"Ratsland Klippag"},{"$f":"IF(OR(B9=\"\",B9=\"-\"),\"\",IFERROR(VLOOKUP($A9,[1]Tabelle2!$A:$I,C$2,FALSE),\"\"))","v":"Baronin Idra ni Bennain von Elenvina, vertreten durch Ratsvogt Radulf von Elenvina"},{"$f":"IF(OR(C9=\"\",C9=\"-\"),\"\",IFERROR(VLOOKUP($A9,[1]Tabelle2!$A:$I,D$2,FALSE),\"\"))","v":1860},{"$f":"IF(OR(D9=\"\",D9=\"-\"),\"\",IFERROR(VLOOKUP($A9,[1]Tabelle2!$A:$I,E$2,FALSE),\"\"))","v":0},1860,0,null,"- Den Bezug zur aktuellen Version des Censuns über \"Daten\" ->"]
["-",{"$f":"IF(OR(A10=\"\",A10=\"-\"),\"\",IFERROR(VLOOKUP($A10,[1]Tabelle2!$A:$I,B$2,FALSE),\"\"))","v":""},{"$f":"IF(OR(B10=\"\",B10=\"-\"),\"\",IFERROR(VLOOKUP($A10,[1]Tabelle2!$A:$I,C$2,FALSE),\"\"))","v":""},{"$f":"IF(OR(C10=\"\",C10=\"-\"),\"\",IFERROR(VLOOKUP($A10,[1]Tabelle2!$A:$I,D$2,FALSE),\"\"))","v":""},{"$f":"IF(OR(D10=\"\",D10=\"-\"),\"\",IFERROR(VLOOKUP($A10,[1]Tabelle2!$A:$I,E$2,FALSE),\"\"))","v":""},"","",null,"\"Verknüpfungen bearbeiten\" herstellen"]
["Nor-I-01-E1",{"$f":"IF(OR(A11=\"\",A11=\"-\"),\"\",IFERROR(VLOOKUP($A11,[1]Tabelle2!$A:$I,B$2,FALSE),\"\"))","v":"Edlengut Furtland"},{"$f":"IF(OR(B11=\"\",B11=\"-\"),\"\",IFERROR(VLOOKUP($A11,[1]Tabelle2!$A:$I,C$2,FALSE),\"\"))","v":"xxx"},{"$f":"IF(OR(C11=\"\",C11=\"-\"),\"\",IFERROR(VLOOKUP($A11,[1]Tabelle2!$A:$I,D$2,FALSE),\"\"))","v":0},{"$f":"IF(OR(D11=\"\",D11=\"-\"),\"\",IFERROR(VLOOKUP($A11,[1]Tabelle2!$A:$I,E$2,FALSE),\"\"))","v":0},0,"",null,"- Die Nr. in Spalte A aus dem aktuellen Census kopieren"]
["Nor-I-01-E2",{"$f":"IF(OR(A12=\"\",A12=\"-\"),\"\",IFERROR(VLOOKUP($A12,[1]Tabelle2!$A:$I,B$2,FALSE),\"\"))","v":"Edlengut Hahnland"},{"$f":"IF(OR(B12=\"\",B12=\"-\"),\"\",IFERROR(VLOOKUP($A12,[1]Tabelle2!$A:$I,C$2,FALSE),\"\"))","v":"xxx"},{"$f":"IF(OR(C12=\"\",C12=\"-\"),\"\",IFERROR(VLOOKUP($A12,[1]Tabelle2!$A:$I,D$2,FALSE),\"\"))","v":0},{"$f":"IF(OR(D12=\"\",D12=\"-\"),\"\",IFERROR(VLOOKUP($A12,[1]Tabelle2!$A:$I,E$2,FALSE),\"\"))","v":0},0,"",null,"- Die Formeln aus B1:F1 hinter die Nummern kopieren"]
["Nor-I-01-E3",{"$f":"IF(OR(A13=\"\",A13=\"-\"),\"\",IFERROR(VLOOKUP($A13,[1]Tabelle2!$A:$I,B$2,FALSE),\"\"))","v":"Edlengut Forstland"},{"$f":"IF(OR(B13=\"\",B13=\"-\"),\"\",IFERROR(VLOOKUP($A13,[1]Tabelle2!$A:$I,C$2,FALSE),\"\"))","v":"xxx"},{"$f":"IF(OR(C13=\"\",C13=\"-\"),\"\",IFERROR(VLOOKUP($A13,[1]Tabelle2!$A:$I,D$2,FALSE),\"\"))","v":0},{"$f":"IF(OR(D13=\"\",D13=\"-\"),\"\",IFERROR(VLOOKUP($A13,[1]Tabelle2!$A:$I,E$2,FALSE),\"\"))","v":0},0,"",null,"- Alle Formeln in B4:Fxxx durch Werte ersetzen"]
["Nor-I-01-E4",{"$f":"IF(OR(A14=\"\",A14=\"-\"),\"\",IFERROR(VLOOKUP($A14,[1]Tabelle2!$A:$I,B$2,FALSE),\"\"))","v":"Edlengut Stiefelstieg"},{"$f":"IF(OR(B14=\"\",B14=\"-\"),\"\",IFERROR(VLOOKUP($A14,[1]Tabelle2!$A:$I,C$2,FALSE),\"\"))","v":"Edler Randoald von Zweibruckenburg"},{"$f":"IF(OR(C14=\"\",C14=\"-\"),\"\",IFERROR(VLOOKUP($A14,[1]Tabelle2!$A:$I,D$2,FALSE),\"\"))","v":0},{"$f":"IF(OR(D14=\"\",D14=\"-\"),\"\",IFERROR(VLOOKUP($A14,[1]Tabelle2!$A:$I,E$2,FALSE),\"\"))","v":0},0,""]
["Nor-I-01-E5",{"$f":"IF(OR(A15=\"\",A15=\"-\"),\"\",IFERROR(VLOOKUP($A15,[1]Tabelle2!$A:$I,B$2,FALSE),\"\"))","v":"Edlengut Wachtland"},{"$f":"IF(OR(B15=\"\",B15=\"-\"),\"\",IFERROR(VLOOKUP($A15,[1]Tabelle2!$A:$I,C$2,FALSE),\"\"))","v":"xxx"},{"$f":"IF(OR(C15=\"\",C15=\"-\"),\"\",IFERROR(VLOOKUP($A15,[1]Tabelle2!$A:$I,D$2,FALSE),\"\"))","v":0},{"$f":"IF(OR(D15=\"\",D15=\"-\"),\"\",IFERROR(VLOOKUP($A15,[1]Tabelle2!$A:$I,E$2,FALSE),\"\"))","v":0},0,""]
["Nor-I-01-E6",{"$f":"IF(OR(A16=\"\",A16=\"-\"),\"\",IFERROR(VLOOKUP($A16,[1]Tabelle2!$A:$I,B$2,FALSE),\"\"))","v":"Edlengut Wogenland"},{"$f":"IF(OR(B16=\"\",B16=\"-\"),\"\",IFERROR(VLOOKUP($A16,[1]Tabelle2!$A:$I,C$2,FALSE),\"\"))","v":"xxx"},{"$f":"IF(OR(C16=\"\",C16=\"-\"),\"\",IFERROR(VLOOKUP($A16,[1]Tabelle2!$A:$I,D$2,FALSE),\"\"))","v":0},{"$f":"IF(OR(D16=\"\",D16=\"-\"),\"\",IFERROR(VLOOKUP($A16,[1]Tabelle2!$A:$I,E$2,FALSE),\"\"))","v":0},0,""]
["Nor-I-01-J1",{"$f":"IF(OR(A17=\"\",A17=\"-\"),\"\",IFERROR(VLOOKUP($A17,[1]Tabelle2!$A:$I,B$2,FALSE),\"\"))","v":"Junkergut Herrnburg"},{"$f":"IF(OR(B17=\"\",B17=\"-\"),\"\",IFERROR(VLOOKUP($A17,[1]Tabelle2!$A:$I,C$2,FALSE),\"\"))","v":"Junkerin Bilhild Ulfahan von Herrnburg"},{"$f":"IF(OR(C17=\"\",C17=\"-\"),\"\",IFERROR(VLOOKUP($A17,[1]Tabelle2!$A:$I,D$2,FALSE),\"\"))","v":0},{"$f":"IF(OR(D17=\"\",D17=\"-\"),\"\",IFERROR(VLOOKUP($A17,[1]Tabelle2!$A:$I,E$2,FALSE),\"\"))","v":0},0,""]
["Nor-I-02P",{"$f":"IF(OR(A18=\"\",A18=\"-\"),\"\",IFERROR(VLOOKUP($A18,[1]Tabelle2!$A:$I,B$2,FALSE),\"\"))","v":"Herzöglich Fuchsgau "},{"$f":"IF(OR(B18=\"\",B18=\"-\"),\"\",IFERROR(VLOOKUP($A18,[1]Tabelle2!$A:$I,C$2,FALSE),\"\"))","v":"Baron Hagrobald Guntwin vom Großen Fluss, vertreten durch Vogt Leodegram von Starkenrast"},{"$f":"IF(OR(C18=\"\",C18=\"-\"),\"\",IFERROR(VLOOKUP($A18,[1]Tabelle2!$A:$I,D$2,FALSE),\"\"))","v":10200},{"$f":"IF(OR(D18=\"\",D18=\"-\"),\"\",IFERROR(VLOOKUP($A18,[1]Tabelle2!$A:$I,E$2,FALSE),\"\"))","v":50},10250,4.8780487804878049E-3]
["Nor-I-02P-E1",{"$f":"IF(OR(A19=\"\",A19=\"-\"),\"\",IFERROR(VLOOKUP($A19,[1]Tabelle2!$A:$I,B$2,FALSE),\"\"))","v":"Edlengut Fuchshag"},{"$f":"IF(OR(B19=\"\",B19=\"-\"),\"\",IFERROR(VLOOKUP($A19,[1]Tabelle2!$A:$I,C$2,FALSE),\"\"))","v":"Edler Onjaro von Fuchshag"},{"$f":"IF(OR(C19=\"\",C19=\"-\"),\"\",IFERROR(VLOOKUP($A19,[1]Tabelle2!$A:$I,D$2,FALSE),\"\"))","v":0},{"$f":"IF(OR(D19=\"\",D19=\"-\"),\"\",IFERROR(VLOOKUP($A19,[1]Tabelle2!$A:$I,E$2,FALSE),\"\"))","v":0},0,""]
["Nor-I-02P-E2",{"$f":"IF(OR(A20=\"\",A20=\"-\"),\"\",IFERROR(VLOOKUP($A20,[1]Tabelle2!$A:$I,B$2,FALSE),\"\"))","v":"Burg Grötz"},{"$f":"IF(OR(B20=\"\",B20=\"-\"),\"\",IFERROR(VLOOKUP($A20,[1]Tabelle2!$A:$I,C$2,FALSE),\"\"))","v":"Leodegram von Starkenrast"},{"$f":"IF(OR(C20=\"\",C20=\"-\"),\"\",IFERROR(VLOOKUP($A20,[1]Tabelle2!$A:$I,D$2,FALSE),\"\"))","v":0},{"$f":"IF(OR(D20=\"\",D20=\"-\"),\"\",IFERROR(VLOOKUP($A20,[1]Tabelle2!$A:$I,E$2,FALSE),\"\"))","v":0},0,""]
["Nor-I-02P-E3",{"$f":"IF(OR(A21=\"\",A21=\"-\"),\"\",IFERROR(VLOOKUP($A21,[1]Tabelle2!$A:$I,B$2,FALSE),\"\"))","v":"Gut Kargenau"},{"$f":"IF(OR(B21=\"\",B21=\"-\"),\"\",IFERROR(VLOOKUP($A21,[1]Tabelle2!$A:$I,C$2,FALSE),\"\"))","v":"-"},{"$f":"IF(OR(C21=\"\",C21=\"-\"),\"\",IFERROR(VLOOKUP($A21,[1]Tabelle2!$A:$I,D$2,FALSE),\"\"))","v":""},{"$f":"IF(OR(D21=\"\",D21=\"-\"),\"\",IFERROR(VLOOKUP($A21,[1]Tabelle2!$A:$I,E$2,FALSE),\"\"))","v":""},"",""]
["Nor-I-02P-E4",{"$f":"IF(OR(A22=\"\",A22=\"-\"),\"\",IFERROR(VLOOKUP($A22,[1]Tabelle2!$A:$I,B$2,FALSE),\"\"))","v":"Gut Altprein"},{"$f":"IF(OR(B22=\"\",B22=\"-\"),\"\",IFERROR(VLOOKUP($A22,[1]Tabelle2!$A:$I,C$2,FALSE),\"\"))","v":"Iseweine von Weiseprein"},{"$f":"IF(OR(C22=\"\",C22=\"-\"),\"\",IFERROR(VLOOKUP($A22,[1]Tabelle2!$A:$I,D$2,FALSE),\"\"))","v":230},{"$f":"IF(OR(D22=\"\",D22=\"-\"),\"\",IFERROR(VLOOKUP($A22,[1]Tabelle2!$A:$I,E$2,FALSE),\"\"))","v":7},237,2.9535864978902954E-2]
["Nor-I-02P-E5",{"$f":"IF(OR(A23=\"\",A23=\"-\"),\"\",IFERROR(VLOOKUP($A23,[1]Tabelle2!$A:$I,B$2,FALSE),\"\"))","v":"Edlengut Erlengrund"},{"$f":"IF(OR(B23=\"\",B23=\"-\"),\"\",IFERROR(VLOOKUP($A23,[1]Tabelle2!$A:$I,C$2,FALSE),\"\"))","v":"Edler Meinrich von Erlengrund"},{"$f":"IF(OR(C23=\"\",C23=\"-\"),\"\",IFERROR(VLOOKUP($A23,[1]Tabelle2!$A:$I,D$2,FALSE),\"\"))","v":0},{"$f":"IF(OR(D23=\"\",D23=\"-\"),\"\",IFERROR(VLOOKUP($A23,[1]Tabelle2!$A:$I,E$2,FALSE),\"\"))","v":0},0,""]
["Nor-I-02P-E6",{"$f":"IF(OR(A24=\"\",A24=\"-\"),\"\",IFERROR(VLOOKUP($A24,[1]Tabelle2!$A:$I,B$2,FALSE),\"\"))","v":"Burg Haduraldsruh"},{"$f":"IF(OR(B24=\"\",B24=\"-\"),\"\",IFERROR(VLOOKUP($A24,[1]Tabelle2!$A:$I,C$2,FALSE),\"\"))","v":"Edler Helmin von Schleiffenröchte"},{"$f":"IF(OR(C24=\"\",C24=\"-\"),\"\",IFERROR(VLOOKUP($A24,[1]Tabelle2!$A:$I,D$2,FALSE),\"\"))","v":0},{"$f":"IF(OR(D24=\"\",D24=\"-\"),\"\",IFERROR(VLOOKUP($A24,[1]Tabelle2!$A:$I,E$2,FALSE),\"\"))","v":0},0,""]
["Nor-I-02P-J1",{"$f":"IF(OR(A25=\"\",A25=\"-\"),\"\",IFERROR(VLOOKUP($A25,[1]Tabelle2!$A:$I,B$2,FALSE),\"\"))","v":"Junkergut Storchengarten"},{"$f":"IF(OR(B25=\"\",B25=\"-\"),\"\",IFERROR(VLOOKUP($A25,[1]Tabelle2!$A:$I,C$2,FALSE),\"\"))","v":"Ivetta von Leihenhof, Vertreten von Zelda Sobelstein"},{"$f":"IF(OR(C25=\"\",C25=\"-\"),\"\",IFERROR(VLOOKUP($A25,[1]Tabelle2!$A:$I,D$2,FALSE),\"\"))","v":0},{"$f":"IF(OR(D25=\"\",D25=\"-\"),\"\",IFERROR(VLOOKUP($A25,[1]Tabelle2!$A:$I,E$2,FALSE),\"\"))","v":0},0,""]
["Nor-I-03P ",{"$f":"IF(OR(A26=\"\",A26=\"-\"),\"\",IFERROR(VLOOKUP($A26,[1]Tabelle2!$A:$I,B$2,FALSE),\"\"))","v":"Herzöglich Bollharschen "},{"$f":"IF(OR(B26=\"\",B26=\"-\"),\"\",IFERROR(VLOOKUP($A26,[1]Tabelle2!$A:$I,C$2,FALSE),\"\"))","v":"Baron Hagrobald Guntwin vom Großen Fluß, vertreten durch Vogt Helmbrecht v. Bösenau "},{"$f":"IF(OR(C26=\"\",C26=\"-\"),\"\",IFERROR(VLOOKUP($A26,[1]Tabelle2!$A:$I,D$2,FALSE),\"\"))","v":5700},{"$f":"IF(OR(D26=\"\",D26=\"-\"),\"\",IFERROR(VLOOKUP($A26,[1]Tabelle2!$A:$I,E$2,FALSE),\"\"))","v":250},5950,4.2016806722689079E-2]
["-",{"$f":"IF(OR(A27=\"\",A27=\"-\"),\"\",IFERROR(VLOOKUP($A27,[1]Tabelle2!$A:$I,B$2,FALSE),\"\"))","v":""},{"$f":"IF(OR(B27=\"\",B27=\"-\"),\"\",IFERROR(VLOOKUP($A27,[1]Tabelle2!$A:$I,C$2,FALSE),\"\"))","v":""},{"$f":"IF(OR(C27=\"\",C27=\"-\"),\"\",IFERROR(VLOOKUP($A27,[1]Tabelle2!$A:$I,D$2,FALSE),\"\"))","v":""},{"$f":"IF(OR(D27=\"\",D27=\"-\"),\"\",IFERROR(VLOOKUP($A27,[1]Tabelle2!$A:$I,E$2,FALSE),\"\"))","v":""},"",""]
["-",{"$f":"IF(OR(A28=\"\",A28=\"-\"),\"\",IFERROR(VLOOKUP($A28,[1]Tabelle2!$A:$I,B$2,FALSE),\"\"))","v":""},{"$f":"IF(OR(B28=\"\",B28=\"-\"),\"\",IFERROR(VLOOKUP($A28,[1]Tabelle2!$A:$I,C$2,FALSE),\"\"))","v":""},{"$f":"IF(OR(C28=\"\",C28=\"-\"),\"\",IFERROR(VLOOKUP($A28,[1]Tabelle2!$A:$I,D$2,FALSE),\"\"))","v":""},{"$f":"IF(OR(D28=\"\",D28=\"-\"),\"\",IFERROR(VLOOKUP($A28,[1]Tabelle2!$A:$I,E$2,FALSE),\"\"))","v":""},"",""]
["-",{"$f":"IF(OR(A29=\"\",A29=\"-\"),\"\",IFERROR(VLOOKUP($A29,[1]Tabelle2!$A:$I,B$2,FALSE),\"\"))","v":""},{"$f":"IF(OR(B29=\"\",B29=\"-\"),\"\",IFERROR(VLOOKUP($A29,[1]Tabelle2!$A:$I,C$2,FALSE),\"\"))","v":""},{"$f":"IF(OR(C29=\"\",C29=\"-\"),\"\",IFERROR(VLOOKUP($A29,[1]Tabelle2!$A:$I,D$2,FALSE),\"\"))","v":""},{"$f":"IF(OR(D29=\"\",D29=\"-\"),\"\",IFERROR(VLOOKUP($A29,[1]Tabelle2!$A:$I,E$2,FALSE),\"\"))","v":""},"",""]
["Nor-I-03P-E1",{"$f":"IF(OR(A30=\"\",A30=\"-\"),\"\",IFERROR(VLOOKUP($A30,[1]Tabelle2!$A:$I,B$2,FALSE),\"\"))","v":"Rittergut Drachentrutz "},{"$f":"IF(OR(B30=\"\",B30=\"-\"),\"\",IFERROR(VLOOKUP($A30,[1]Tabelle2!$A:$I,C$2,FALSE),\"\"))","v":"Ritter Alrik Dernheim v.Drachentrutz "},{"$f":"IF(OR(C30=\"\",C30=\"-\"),\"\",IFERROR(VLOOKUP($A30,[1]Tabelle2!$A:$I,D$2,FALSE),\"\"))","v":0},{"$f":"IF(OR(D30=\"\",D30=\"-\"),\"\",IFERROR(VLOOKUP($A30,[1]Tabelle2!$A:$I,E$2,FALSE),\"\"))","v":0},0,""]
["Nor-I-03P-E2",{"$f":"IF(OR(A31=\"\",A31=\"-\"),\"\",IFERROR(VLOOKUP($A31,[1]Tabelle2!$A:$I,B$2,FALSE),\"\"))","v":"Rittergut Dernheim"},{"$f":"IF(OR(B31=\"\",B31=\"-\"),\"\",IFERROR(VLOOKUP($A31,[1]Tabelle2!$A:$I,C$2,FALSE),\"\"))","v":"Ritter Alrik Dernheim v.Drachentrutz "},{"$f":"IF(OR(C31=\"\",C31=\"-\"),\"\",IFERROR(VLOOKUP($A31,[1]Tabelle2!$A:$I,D$2,FALSE),\"\"))","v":0},{"$f":"IF(OR(D31=\"\",D31=\"-\"),\"\",IFERROR(VLOOKUP($A31,[1]Tabelle2!$A:$I,E$2,FALSE),\"\"))","v":0},0,""]
["Nor-I-03P-E3",{"$f":"IF(OR(A32=\"\",A32=\"-\"),\"\",IFERROR(VLOOKUP($A32,[1]Tabelle2!$A:$I,B$2,FALSE),\"\"))","v":"Gut Morgenau"},{"$f":"IF(OR(B32=\"\",B32=\"-\"),\"\",IFERROR(VLOOKUP($A32,[1]Tabelle2!$A:$I,C$2,FALSE),\"\"))","v":"Quarion von Quakenbrück"},{"$f":"IF(OR(C32=\"\",C32=\"-\"),\"\",IFERROR(VLOOKUP($A32,[1]Tabelle2!$A:$I,D$2,FALSE),\"\"))","v":0},{"$f":"IF(OR(D32=\"\",D32=\"-\"),\"\",IFERROR(VLOOKUP($A32,[1]Tabelle2!$A:$I,E$2,FALSE),\"\"))","v":0},0,""]
["Nor-I-03P-E4",{"$f":"IF(OR(A33=\"\",A33=\"-\"),\"\",IFERROR(VLOOKUP($A33,[1]Tabelle2!$A:$I,B$2,FALSE),\"\"))","v":"Dorf Eisenbrück"},{"$f":"IF(OR(B33=\"\",B33=\"-\"),\"\",IFERROR(VLOOKUP($A33,[1]Tabelle2!$A:$I,C$2,FALSE),\"\"))","v":"-"},{"$f":"IF(OR(C33=\"\",C33=\"-\"),\"\",IFERROR(VLOOKUP($A33,[1]Tabelle2!$A:$I,D$2,FALSE),\"\"))","v":""},{"$f":"IF(OR(D33=\"\",D33=\"-\"),\"\",IFERROR(VLOOKUP($A33,[1]Tabelle2!$A:$I,E$2,FALSE),\"\"))","v":""},"",""]
["Nor-I-03P-J1",{"$f":"IF(OR(A34=\"\",A34=\"-\"),\"\",IFERROR(VLOOKUP($A34,[1]Tabelle2!$A:$I,B$2,FALSE),\"\"))","v":"Junkergut Züchtelsen"},{"$f":"IF(OR(B34=\"\",B34=\"-\"),\"\",IFERROR(VLOOKUP($A34,[1]Tabelle2!$A:$I,C$2,FALSE),\"\"))","v":"Junker Kalman v. Züchtelsen "},{"$f":"IF(OR(C34=\"\",C34=\"-\"),\"\",IFERROR(VLOOKUP($A34,[1]Tabelle2!$A:$I,D$2,FALSE),\"\"))","v":0},{"$f":"IF(OR(D34=\"\",D34=\"-\"),\"\",IFERROR(VLOOKUP($A34,[1]Tabelle2!$A:$I,E$2,FALSE),\"\"))","v":0},0,""]
["Nor-I-03P-J2",{"$f":"IF(OR(A35=\"\",A35=\"-\"),\"\",IFERROR(VLOOKUP($A35,[1]Tabelle2!$A:$I,B$2,FALSE),\"\"))","v":"Gut Finstermoor"},{"$f":"IF(OR(B35=\"\",B35=\"-\"),\"\",IFERROR(VLOOKUP($A35,[1]Tabelle2!$A:$I,C$2,FALSE),\"\"))","v":"-"},{"$f":"IF(OR(C35=\"\",C35=\"-\"),\"\",IFERROR(VLOOKUP($A35,[1]Tabelle2!$A:$I,D$2,FALSE),\"\"))","v":""},{"$f":"IF(OR(D35=\"\",D35=\"-\"),\"\",IFERROR(VLOOKUP($A35,[1]Tabelle2!$A:$I,E$2,FALSE),\"\"))","v":""},"",""]
["Nor-II ",{"$f":"IF(OR(A36=\"\",A36=\"-\"),\"\",IFERROR(VLOOKUP($A36,[1]Tabelle2!$A:$I,B$2,FALSE),\"\"))","v":"Grafschaft Isenhag "},{"$f":"IF(OR(B36=\"\",B36=\"-\"),\"\",IFERROR(VLOOKUP($A36,[1]Tabelle2!$A:$I,C$2,FALSE),\"\"))","v":"Graf Ghambir, Sohn des Gruin "},{"$f":"IF(OR(C36=\"\",C36=\"-\"),\"\",IFERROR(VLOOKUP($A36,[1]Tabelle2!$A:$I,D$2,FALSE),\"\"))","v":50100},{"$f":"IF(OR(D36=\"\",D36=\"-\"),\"\",IFERROR(VLOOKUP($A36,[1]Tabelle2!$A:$I,E$2,FALSE),\"\"))","v":6055},56155,0.10782655150921557]
["Nor-II-01 ",{"$f":"IF(OR(A37=\"\",A37=\"-\"),\"\",IFERROR(VLOOKUP($A37,[1]Tabelle2!$A:$I,B$2,FALSE),\"\"))","v":"Baronie Kyndoch "},{"$f":"IF(OR(B37=\"\",B37=\"-\"),\"\",IFERROR(VLOOKUP($A37,[1]Tabelle2!$A:$I,C$2,FALSE),\"\"))","v":"Baron Liafwin von Fadersberg zu Kyndoch"},{"$f":"IF(OR(C37=\"\",C37=\"-\"),\"\",IFERROR(VLOOKUP($A37,[1]Tabelle2!$A:$I,D$2,FALSE),\"\"))","v":9100},{"$f":"IF(OR(D37=\"\",D37=\"-\"),\"\",IFERROR(VLOOKUP($A37,[1]Tabelle2!$A:$I,E$2,FALSE),\"\"))","v":55},9155,6.0076460950300378E-3]
["-",{"$f":"IF(OR(A38=\"\",A38=\"-\"),\"\",IFERROR(VLOOKUP($A38,[1]Tabelle2!$A:$I,B$2,FALSE),\"\"))","v":""},{"$f":"IF(OR(B38=\"\",B38=\"-\"),\"\",IFERROR(VLOOKUP($A38,[1]Tabelle2!$A:$I,C$2,FALSE),\"\"))","v":""},{"$f":"IF(OR(C38=\"\",C38=\"-\"),\"\",IFERROR(VLOOKUP($A38,[1]Tabelle2!$A:$I,D$2,FALSE),\"\"))","v":""},{"$f":"IF(OR(D38=\"\",D38=\"-\"),\"\",IFERROR(VLOOKUP($A38,[1]Tabelle2!$A:$I,E$2,FALSE),\"\"))","v":""},"",""]
["Nor-II-01-E1",{"$f":"IF(OR(A39=\"\",A39=\"-\"),\"\",IFERROR(VLOOKUP($A39,[1]Tabelle2!$A:$I,B$2,FALSE),\"\"))","v":"Edlengut Rodenbrück"},{"$f":"IF(OR(B39=\"\",B39=\"-\"),\"\",IFERROR(VLOOKUP($A39,[1]Tabelle2!$A:$I,C$2,FALSE),\"\"))","v":"Rondriane Cella von Rodenbrück"},{"$f":"IF(OR(C39=\"\",C39=\"-\"),\"\",IFERROR(VLOOKUP($A39,[1]Tabelle2!$A:$I,D$2,FALSE),\"\"))","v":350},{"$f":"IF(OR(D39=\"\",D39=\"-\"),\"\",IFERROR(VLOOKUP($A39,[1]Tabelle2!$A:$I,E$2,FALSE),\"\"))","v":0},350,0]
["Nor-II-01-E2",{"$f":"IF(OR(A40=\"\",A40=\"-\"),\"\",IFERROR(VLOOKUP($A40,[1]Tabelle2!$A:$I,B$2,FALSE),\"\"))","v":"Edlengut Kronau"},{"$f":"IF(OR(B40=\"\",B40=\"-\"),\"\",IFERROR(VLOOKUP($A40,[1]Tabelle2!$A:$I,C$2,FALSE),\"\"))","v":"Edle Verladindhana von Hamrath"},{"$f":"IF(OR(C40=\"\",C40=\"-\"),\"\",IFERROR(VLOOKUP($A40,[1]Tabelle2!$A:$I,D$2,FALSE),\"\"))","v":1500},{"$f":"IF(OR(D40=\"\",D40=\"-\"),\"\",IFERROR(VLOOKUP($A40,[1]Tabelle2!$A:$I,E$2,FALSE),\"\"))","v":0},1500,0]
["Nor-II-01-E3",{"$f":"IF(OR(A41=\"\",A41=\"-\"),\"\",IFERROR(VLOOKUP($A41,[1]Tabelle2!$A:$I,B$2,FALSE),\"\"))","v":"Rittergut Tannwald"},{"$f":"IF(OR(B41=\"\",B41=\"-\"),\"\",IFERROR(VLOOKUP($A41,[1]Tabelle2!$A:$I,C$2,FALSE),\"\"))","v":"Gilia von Zweigensang "},{"$f":"IF(OR(C41=\"\",C41=\"-\"),\"\",IFERROR(VLOOKUP($A41,[1]Tabelle2!$A:$I,D$2,FALSE),\"\"))","v":300},{"$f":"IF(OR(D41=\"\",D41=\"-\"),\"\",IFERROR(VLOOKUP($A41,[1]Tabelle2!$A:$I,E$2,FALSE),\"\"))","v":0},300,0]
["Nor-II-01-E4",{"$f":"IF(OR(A42=\"\",A42=\"-\"),\"\",IFERROR(VLOOKUP($A42,[1]Tabelle2!$A:$I,B$2,FALSE),\"\"))","v":"Rittergut Linnartstein"},{"$f":"IF(OR(B42=\"\",B42=\"-\"),\"\",IFERROR(VLOOKUP($A42,[1]Tabelle2!$A:$I,C$2,FALSE),\"\"))","v":"Ritter Thymon vom Traurigen Stein"},{"$f":"IF(OR(C42=\"\",C42=\"-\"),\"\",IFERROR(VLOOKUP($A42,[1]Tabelle2!$A:$I,D$2,FALSE),\"\"))","v":450},{"$f":"IF(OR(D42=\"\",D42=\"-\"),\"\",IFERROR(VLOOKUP($A42,[1]Tabelle2!$A:$I,E$2,FALSE),\"\"))","v":0},450,0]
["Nor-II-01-J1",{"$f":"IF(OR(A43=\"\",A43=\"-\"),\"\",IFERROR(VLOOKUP($A43,[1]Tabelle2!$A:$I,B$2,FALSE),\"\"))","v":"Junkergut Ostendorf"},{"$f":"IF(OR(B43=\"\",B43=\"-\"),\"\",IFERROR(VLOOKUP($A43,[1]Tabelle2!$A:$I,C$2,FALSE),\"\"))","v":"Junker Otgar von Salmfang"},{"$f":"IF(OR(C43=\"\",C43=\"-\"),\"\",IFERROR(VLOOKUP($A43,[1]Tabelle2!$A:$I,D$2,FALSE),\"\"))","v":2250},{"$f":"IF(OR(D43=\"\",D43=\"-\"),\"\",IFERROR(VLOOKUP($A43,[1]Tabelle2!$A:$I,E$2,FALSE),\"\"))","v":5},2255,2.2172949002217295E-3]
["Nor-II-01-J1-R1",{"$f":"IF(OR(A44=\"\",A44=\"-\"),\"\",IFERROR(VLOOKUP($A44,[1]Tabelle2!$A:$I,B$2,FALSE),\"\"))","v":"Rittergut Klein Münzberg"},{"$f":"IF(OR(B44=\"\",B44=\"-\"),\"\",IFERROR(VLOOKUP($A44,[1]Tabelle2!$A:$I,C$2,FALSE),\"\"))","v":"Ritter Aurian von Münzberg"},{"$f":"IF(OR(C44=\"\",C44=\"-\"),\"\",IFERROR(VLOOKUP($A44,[1]Tabelle2!$A:$I,D$2,FALSE),\"\"))","v":450},{"$f":"IF(OR(D44=\"\",D44=\"-\"),\"\",IFERROR(VLOOKUP($A44,[1]Tabelle2!$A:$I,E$2,FALSE),\"\"))","v":5},455,1.098901098901099E-2]
["Nor-II-02 ",{"$f":"IF(OR(A45=\"\",A45=\"-\"),\"\",IFERROR(VLOOKUP($A45,[1]Tabelle2!$A:$I,B$2,FALSE),\"\"))","v":"Baronie Tandosch "},{"$f":"IF(OR(B45=\"\",B45=\"-\"),\"\",IFERROR(VLOOKUP($A45,[1]Tabelle2!$A:$I,C$2,FALSE),\"\"))","v":"Baron Irian von Tandosch "},{"$f":"IF(OR(C45=\"\",C45=\"-\"),\"\",IFERROR(VLOOKUP($A45,[1]Tabelle2!$A:$I,D$2,FALSE),\"\"))","v":5000},{"$f":"IF(OR(D45=\"\",D45=\"-\"),\"\",IFERROR(VLOOKUP($A45,[1]Tabelle2!$A:$I,E$2,FALSE),\"\"))","v":150},5150,2.9126213592233011E-2]
[null,{"$f":"IF(OR(A46=\"\",A46=\"-\"),\"\",IFERROR(VLOOKUP($A46,[1]Tabelle2!$A:$I,B$2,FALSE),\"\"))","v":""},{"$f":"IF(OR(B46=\"\",B46=\"-\"),\"\",IFERROR(VLOOKUP($A46,[1]Tabelle2!$A:$I,C$2,FALSE),\"\"))","v":""},{"$f":"IF(OR(C46=\"\",C46=\"-\"),\"\",IFERROR(VLOOKUP($A46,[1]Tabelle2!$A:$I,D$2,FALSE),\"\"))","v":""},{"$f":"IF(OR(D46=\"\",D46=\"-\"),\"\",IFERROR(VLOOKUP($A46,[1]Tabelle2!$A:$I,E$2,FALSE),\"\"))","v":""},"",""]
["Nor-II-02-J1",{"$f":"IF(OR(A47=\"\",A47=\"-\"),\"\",IFERROR(VLOOKUP($A47,[1]Tabelle2!$A:$I,B$2,FALSE),\"\"))","v":"Edlengut Bärenkoppen"},{"$f":"IF(OR(B47=\"\",B47=\"-\"),\"\",IFERROR(VLOOKUP($A47,[1]Tabelle2!$A:$I,C$2,FALSE),\"\"))","v":"Edler Viknas von Bärenkoppen"},{"$f":"IF(OR(C47=\"\",C47=\"-\"),\"\",IFERROR(VLOOKUP($A47,[1]Tabelle2!$A:$I,D$2,FALSE),\"\"))","v":0},{"$f":"IF(OR(D47=\"\",D47=\"-\"),\"\",IFERROR(VLOOKUP($A47,[1]Tabelle2!$A:$I,E$2,FALSE),\"\"))","v":0},0,""]
["Nor-II-03P ",{"$f":"IF(OR(A48=\"\",A48=\"-\"),\"\",IFERROR(VLOOKUP($A48,[1]Tabelle2!$A:$I,B$2,FALSE),\"\"))","v":"Herzöglich Brüllenbösen "},{"$f":"IF(OR(B48=\"\",B48=\"-\"),\"\",IFERROR(VLOOKUP($A48,[1]Tabelle2!$A:$I,C$2,FALSE),\"\"))","v":"Baron Hagrobald Guntwin vom Großen Fluß, Vogt Barox, Sohn des Burgamon "},{"$f":"IF(OR(C48=\"\",C48=\"-\"),\"\",IFERROR(VLOOKUP($A48,[1]Tabelle2!$A:$I,D$2,FALSE),\"\"))","v":2500},{"$f":"IF(OR(D48=\"\",D48=\"-\"),\"\",IFERROR(VLOOKUP($A48,[1]Tabelle2!$A:$I,E$2,FALSE),\"\"))","v":200},2700,7.407407407407407E-2]
["-",{"$f":"IF(OR(A49=\"\",A49=\"-\"),\"\",IFERROR(VLOOKUP($A49,[1]Tabelle2!$A:$I,B$2,FALSE),\"\"))","v":""},{"$f":"IF(OR(B49=\"\",B49=\"-\"),\"\",IFERROR(VLOOKUP($A49,[1]Tabelle2!$A:$I,C$2,FALSE),\"\"))","v":""},{"$f":"IF(OR(C49=\"\",C49=\"-\"),\"\",IFERROR(VLOOKUP($A49,[1]Tabelle2!$A:$I,D$2,FALSE),\"\"))","v":""},{"$f":"IF(OR(D49=\"\",D49=\"-\"),\"\",IFERROR(VLOOKUP($A49,[1]Tabelle2!$A:$I,E$2,FALSE),\"\"))","v":""},"",""]
["Nor-II-03P-E1",{"$f":"IF(OR(A50=\"\",A50=\"-\"),\"\",IFERROR(VLOOKUP($A50,[1]Tabelle2!$A:$I,B$2,FALSE),\"\"))","v":"Edlengut Erzwacht "},{"$f":"IF(OR(B50=\"\",B50=\"-\"),\"\",IFERROR(VLOOKUP($A50,[1]Tabelle2!$A:$I,C$2,FALSE),\"\"))","v":"Edler Xorgolosch Sohn des Fuldoram "},{"$f":"IF(OR(C50=\"\",C50=\"-\"),\"\",IFERROR(VLOOKUP($A50,[1]Tabelle2!$A:$I,D$2,FALSE),\"\"))","v":280},{"$f":"IF(OR(D50=\"\",D50=\"-\"),\"\",IFERROR(VLOOKUP($A50,[1]Tabelle2!$A:$I,E$2,FALSE),\"\"))","v":" "},"",""]
["Nor-II-03P-E2",{"$f":"IF(OR(A51=\"\",A51=\"-\"),\"\",IFERROR(VLOOKUP($A51,[1]Tabelle2!$A:$I,B$2,FALSE),\"\"))","v":"Burg Landwacht"},{"$f":"IF(OR(B51=\"\",B51=\"-\"),\"\",IFERROR(VLOOKUP($A51,[1]Tabelle2!$A:$I,C$2,FALSE),\"\"))","v":"Ritter Filwald von Landwacht"},{"$f":"IF(OR(C51=\"\",C51=\"-\"),\"\",IFERROR(VLOOKUP($A51,[1]Tabelle2!$A:$I,D$2,FALSE),\"\"))","v":600},{"$f":"IF(OR(D51=\"\",D51=\"-\"),\"\",IFERROR(VLOOKUP($A51,[1]Tabelle2!$A:$I,E$2,FALSE),\"\"))","v":0},600,0]
["Nor-II-03P-E3",{"$f":"IF(OR(A52=\"\",A52=\"-\"),\"\",IFERROR(VLOOKUP($A52,[1]Tabelle2!$A:$I,B$2,FALSE),\"\"))","v":"Rittergut Ackerfelde"},{"$f":"IF(OR(B52=\"\",B52=\"-\"),\"\",IFERROR(VLOOKUP($A52,[1]Tabelle2!$A:$I,C$2,FALSE),\"\"))","v":"Ritter Halmar von Schellenberg zu Ackerfelde"},{"$f":"IF(OR(C52=\"\",C52=\"-\"),\"\",IFERROR(VLOOKUP($A52,[1]Tabelle2!$A:$I,D$2,FALSE),\"\"))","v":740},{"$f":"IF(OR(D52=\"\",D52=\"-\"),\"\",IFERROR(VLOOKUP($A52,[1]Tabelle2!$A:$I,E$2,FALSE),\"\"))","v":0},740,0]
["Nor-II-03P-E4",{"$f":"IF(OR(A53=\"\",A53=\"-\"),\"\",IFERROR(VLOOKUP($A53,[1]Tabelle2!$A:$I,B$2,FALSE),\"\"))","v":"Edlengut Grafenstift"},{"$f":"IF(OR(B53=\"\",B53=\"-\"),\"\",IFERROR(VLOOKUP($A53,[1]Tabelle2!$A:$I,C$2,FALSE),\"\"))","v":"Edler Kinson von Korogar zu Grafenstift"},{"$f":"IF(OR(C53=\"\",C53=\"-\"),\"\",IFERROR(VLOOKUP($A53,[1]Tabelle2!$A:$I,D$2,FALSE),\"\"))","v":510},{"$f":"IF(OR(D53=\"\",D53=\"-\"),\"\",IFERROR(VLOOKUP($A53,[1]Tabelle2!$A:$I,E$2,FALSE),\"\"))","v":0},510,0]
["Nor-II-03P-E5",{"$f":"IF(OR(A54=\"\",A54=\"-\"),\"\",IFERROR(VLOOKUP($A54,[1]Tabelle2!$A:$I,B$2,FALSE),\"\"))","v":"Gut Wiedenhof"},{"$f":"IF(OR(B54=\"\",B54=\"-\"),\"\",IFERROR(VLOOKUP($A54,[1]Tabelle2!$A:$I,C$2,FALSE),\"\"))","v":"Ambrosius von Wiedenhof"},{"$f":"IF(OR(C54=\"\",C54=\"-\"),\"\",IFERROR(VLOOKUP($A54,[1]Tabelle2!$A:$I,D$2,FALSE),\"\"))","v":370},{"$f":"IF(OR(D54=\"\",D54=\"-\"),\"\",IFERROR(VLOOKUP($A54,[1]Tabelle2!$A:$I,E$2,FALSE),\"\"))","v":0},370,0]
["Nor-II-04 ",{"$f":"IF(OR(A55=\"\",A55=\"-\"),\"\",IFERROR(VLOOKUP($A55,[1]Tabelle2!$A:$I,B$2,FALSE),\"\"))","v":"Baronie Rodaschquell "},{"$f":"IF(OR(B55=\"\",B55=\"-\"),\"\",IFERROR(VLOOKUP($A55,[1]Tabelle2!$A:$I,C$2,FALSE),\"\"))","v":"Baronin Liana Alyandéra Morgenrot von Rodaschquell "},{"$f":"IF(OR(C55=\"\",C55=\"-\"),\"\",IFERROR(VLOOKUP($A55,[1]Tabelle2!$A:$I,D$2,FALSE),\"\"))","v":2200},{"$f":"IF(OR(D55=\"\",D55=\"-\"),\"\",IFERROR(VLOOKUP($A55,[1]Tabelle2!$A:$I,E$2,FALSE),\"\"))","v":200},2400,8.3333333333333329E-2]
["-",{"$f":"IF(OR(A56=\"\",A56=\"-\"),\"\",IFERROR(VLOOKUP($A56,[1]Tabelle2!$A:$I,B$2,FALSE),\"\"))","v":""},{"$f":"IF(OR(B56=\"\",B56=\"-\"),\"\",IFERROR(VLOOKUP($A56,[1]Tabelle2!$A:$I,C$2,FALSE),\"\"))","v":""},{"$f":"IF(OR(C56=\"\",C56=\"-\"),\"\",IFERROR(VLOOKUP($A56,[1]Tabelle2!$A:$I,D$2,FALSE),\"\"))","v":""},{"$f":"IF(OR(D56=\"\",D56=\"-\"),\"\",IFERROR(VLOOKUP($A56,[1]Tabelle2!$A:$I,E$2,FALSE),\"\"))","v":""},"",""]
["Nor-II-04-E1 ",{"$f":"IF(OR(A57=\"\",A57=\"-\"),\"\",IFERROR(VLOOKUP($A57,[1]Tabelle2!$A:$I,B$2,FALSE),\"\"))","v":"Gut Rosenhain "},{"$f":"IF(OR(B57=\"\",B57=\"-\"),\"\",IFERROR(VLOOKUP($A57,[1]Tabelle2!$A:$I,C$2,FALSE),\"\"))","v":"Edler Ernbrecht Travialieb von Mersingen j.H. zu Rosenhain "},{"$f":"IF(OR(C57=\"\",C57=\"-\"),\"\",IFERROR(VLOOKUP($A57,[1]Tabelle2!$A:$I,D$2,FALSE),\"\"))","v":0},{"$f":"IF(OR(D57=\"\",D57=\"-\"),\"\",IFERROR(VLOOKUP($A57,[1]Tabelle2!$A:$I,E$2,FALSE),\"\"))","v":0},0,""]
["Nor-II-04-E2 ",{"$f":"IF(OR(A58=\"\",A58=\"-\"),\"\",IFERROR(VLOOKUP($A58,[1]Tabelle2!$A:$I,B$2,FALSE),\"\"))","v":"Gut Wernhag "},{"$f":"IF(OR(B58=\"\",B58=\"-\"),\"\",IFERROR(VLOOKUP($A58,[1]Tabelle2!$A:$I,C$2,FALSE),\"\"))","v":"Ritter Ferdilas von Avaris zu Wernhag "},{"$f":"IF(OR(C58=\"\",C58=\"-\"),\"\",IFERROR(VLOOKUP($A58,[1]Tabelle2!$A:$I,D$2,FALSE),\"\"))","v":30},{"$f":"IF(OR(D58=\"\",D58=\"-\"),\"\",IFERROR(VLOOKUP($A58,[1]Tabelle2!$A:$I,E$2,FALSE),\"\"))","v":" "},"",""]
["Nor-II-05aBK ",{"$f":"IF(OR(A59=\"\",A59=\"-\"),\"\",IFERROR(VLOOKUP($A59,[1]Tabelle2!$A:$I,B$2,FALSE),\"\"))","v":"Bergfreiheit Xorlosch "},{"$f":"IF(OR(B59=\"\",B59=\"-\"),\"\",IFERROR(VLOOKUP($A59,[1]Tabelle2!$A:$I,C$2,FALSE),\"\"))","v":"Bergkönig Tschubax, Sohn des Tuagel von Xorlosch "},{"$f":"IF(OR(C59=\"\",C59=\"-\"),\"\",IFERROR(VLOOKUP($A59,[1]Tabelle2!$A:$I,D$2,FALSE),\"\"))","v":300},{"$f":"IF(OR(D59=\"\",D59=\"-\"),\"\",IFERROR(VLOOKUP($A59,[1]Tabelle2!$A:$I,E$2,FALSE),\"\"))","v":1850},2150,0.86046511627906974]
["Nor-II-05bBK ",{"$f":"IF(OR(A60=\"\",A60=\"-\"),\"\",IFERROR(VLOOKUP($A60,[1]Tabelle2!$A:$I,B$2,FALSE),\"\"))","v":"Stadt Xorlosch "},{"$f":"IF(OR(B60=\"\",B60=\"-\"),\"\",IFERROR(VLOOKUP($A60,[1]Tabelle2!$A:$I,C$2,FALSE),\"\"))","v":"Bergkönig Tschubax, Sohn des Tuagel von Xorlosch "},{"$f":"IF(OR(C60=\"\",C60=\"-\"),\"\",IFERROR(VLOOKUP($A60,[1]Tabelle2!$A:$I,D$2,FALSE),\"\"))","v":0},{"$f":"IF(OR(D60=\"\",D60=\"-\"),\"\",IFERROR(VLOOKUP($A60,[1]Tabelle2!$A:$I,E$2,FALSE),\"\"))","v":1600},1600,1]
["Nor-II-05BK-G",{"$f":"IF(OR(A61=\"\",A61=\"-\"),\"\",IFERROR(VLOOKUP($A61,[1]Tabelle2!$A:$I,B$2,FALSE),\"\"))","v":"Vogtei Oberrodasch "},{"$f":"IF(OR(B61=\"\",B61=\"-\"),\"\",IFERROR(VLOOKUP($A61,[1]Tabelle2!$A:$I,C$2,FALSE),\"\"))","v":"Vogtin Utsinde v. Plötzbogen "},{"$f":"IF(OR(C61=\"\",C61=\"-\"),\"\",IFERROR(VLOOKUP($A61,[1]Tabelle2!$A:$I,D$2,FALSE),\"\"))","v":" "},{"$f":"IF(OR(D61=\"\",D61=\"-\"),\"\",IFERROR(VLOOKUP($A61,[1]Tabelle2!$A:$I,E$2,FALSE),\"\"))","v":" "},"",""]
["Nor-II-05BK-E1",{"$f":"IF(OR(A62=\"\",A62=\"-\"),\"\",IFERROR(VLOOKUP($A62,[1]Tabelle2!$A:$I,B$2,FALSE),\"\"))","v":"Edlengut Hetzenberg"},{"$f":"IF(OR(B62=\"\",B62=\"-\"),\"\",IFERROR(VLOOKUP($A62,[1]Tabelle2!$A:$I,C$2,FALSE),\"\"))","v":"Edler Hechard von Hetzenberg"},{"$f":"IF(OR(C62=\"\",C62=\"-\"),\"\",IFERROR(VLOOKUP($A62,[1]Tabelle2!$A:$I,D$2,FALSE),\"\"))","v":0},{"$f":"IF(OR(D62=\"\",D62=\"-\"),\"\",IFERROR(VLOOKUP($A62,[1]Tabelle2!$A:$I,E$2,FALSE),\"\"))","v":0},0,""]
["Nor-II-06K-E1",{"$f":"IF(OR(A63=\"\",A63=\"-\"),\"\",IFERROR(VLOOKUP($A63,[1]Tabelle2!$A:$I,B$2,FALSE),\"\"))","v":"Pfalzgrafschaft Angroschsgau "},{"$f":"IF(OR(B63=\"\",B63=\"-\"),\"\",IFERROR(VLOOKUP($A63,[1]Tabelle2!$A:$I,C$2,FALSE),\"\"))","v":"Kaiserin Rohaja von Gareth, vertreten durch Ratosch, Sohn des Rathorn von Angroschsgau "},{"$f":"IF(OR(C63=\"\",C63=\"-\"),\"\",IFERROR(VLOOKUP($A63,[1]Tabelle2!$A:$I,D$2,FALSE),\"\"))","v":1900},{"$f":"IF(OR(D63=\"\",D63=\"-\"),\"\",IFERROR(VLOOKUP($A63,[1]Tabelle2!$A:$I,E$2,FALSE),\"\"))","v":300},2200,0.13636363636363635]
["Nor-II-06K-E1",{"$f":"IF(OR(A64=\"\",A64=\"-\"),\"\",IFERROR(VLOOKUP($A64,[1]Tabelle2!$A:$I,B$2,FALSE),\"\"))","v":"Pfalzgrafschaft Angroschsgau "},{"$f":"IF(OR(B64=\"\",B64=\"-\"),\"\",IFERROR(VLOOKUP($A64,[1]Tabelle2!$A:$I,C$2,FALSE),\"\"))","v":"Kaiserin Rohaja von Gareth, vertreten durch Ratosch, Sohn des Rathorn von Angroschsgau "},{"$f":"IF(OR(C64=\"\",C64=\"-\"),\"\",IFERROR(VLOOKUP($A64,[1]Tabelle2!$A:$I,D$2,FALSE),\"\"))","v":1900},{"$f":"IF(OR(D64=\"\",D64=\"-\"),\"\",IFERROR(VLOOKUP($A64,[1]Tabelle2!$A:$I,E$2,FALSE),\"\"))","v":300},2200,0.13636363636363635]
["Nor-II-07G",{"$f":"IF(OR(A65=\"\",A65=\"-\"),\"\",IFERROR(VLOOKUP($A65,[1]Tabelle2!$A:$I,B$2,FALSE),\"\"))","v":"Gräflich Wedengraben"},{"$f":"IF(OR(B65=\"\",B65=\"-\"),\"\",IFERROR(VLOOKUP($A65,[1]Tabelle2!$A:$I,C$2,FALSE),\"\"))","v":"Graf Ghambir, Sohn des Gruin, vertreten durch Vogt Grubosch, Sohn des Gurthag v. Wedenstein "},{"$f":"IF(OR(C65=\"\",C65=\"-\"),\"\",IFERROR(VLOOKUP($A65,[1]Tabelle2!$A:$I,D$2,FALSE),\"\"))","v":2400},{"$f":"IF(OR(D65=\"\",D65=\"-\"),\"\",IFERROR(VLOOKUP($A65,[1]Tabelle2!$A:$I,E$2,FALSE),\"\"))","v":650},3050,0.21311475409836064]
["-",{"$f":"IF(OR(A66=\"\",A66=\"-\"),\"\",IFERROR(VLOOKUP($A66,[1]Tabelle2!$A:$I,B$2,FALSE),\"\"))","v":""},{"$f":"IF(OR(B66=\"\",B66=\"-\"),\"\",IFERROR(VLOOKUP($A66,[1]Tabelle2!$A:$I,C$2,FALSE),\"\"))","v":""},{"$f":"IF(OR(C66=\"\",C66=\"-\"),\"\",IFERROR(VLOOKUP($A66,[1]Tabelle2!$A:$I,D$2,FALSE),\"\"))","v":""},{"$f":"IF(OR(D66=\"\",D66=\"-\"),\"\",IFERROR(VLOOKUP($A66,[1]Tabelle2!$A:$I,E$2,FALSE),\"\"))","v":""},"",""]
["-",{"$f":"IF(OR(A67=\"\",A67=\"-\"),\"\",IFERROR(VLOOKUP($A67,[1]Tabelle2!$A:$I,B$2,FALSE),\"\"))","v":""},{"$f":"IF(OR(B67=\"\",B67=\"-\"),\"\",IFERROR(VLOOKUP($A67,[1]Tabelle2!$A:$I,C$2,FALSE),\"\"))","v":""},{"$f":"IF(OR(C67=\"\",C67=\"-\"),\"\",IFERROR(VLOOKUP($A67,[1]Tabelle2!$A:$I,D$2,FALSE),\"\"))","v":""},{"$f":"IF(OR(D67=\"\",D67=\"-\"),\"\",IFERROR(VLOOKUP($A67,[1]Tabelle2!$A:$I,E$2,FALSE),\"\"))","v":""},"",""]
["Nor-II-08 ",{"$f":"IF(OR(A68=\"\",A68=\"-\"),\"\",IFERROR(VLOOKUP($A68,[1]Tabelle2!$A:$I,B$2,FALSE),\"\"))","v":"Baronie Eisenstein "},{"$f":"IF(OR(B68=\"\",B68=\"-\"),\"\",IFERROR(VLOOKUP($A68,[1]Tabelle2!$A:$I,C$2,FALSE),\"\"))","v":"Baron Rajodan v. Keyserring auf Eisenstein "},{"$f":"IF(OR(C68=\"\",C68=\"-\"),\"\",IFERROR(VLOOKUP($A68,[1]Tabelle2!$A:$I,D$2,FALSE),\"\"))","v":5100},{"$f":"IF(OR(D68=\"\",D68=\"-\"),\"\",IFERROR(VLOOKUP($A68,[1]Tabelle2!$A:$I,E$2,FALSE),\"\"))","v":100},{"$f":"IFERROR(D68+E68,\"\")","v":5200},1.9230769230769232E-2]
["Nor-II-08-E1",{"$f":"IF(OR(A69=\"\",A69=\"-\"),\"\",IFERROR(VLOOKUP($A69,[1]Tabelle2!$A:$I,B$2,FALSE),\"\"))","v":"Gut Bösenau"},{"$f":"IF(OR(B69=\"\",B69=\"-\"),\"\",IFERROR(VLOOKUP($A69,[1]Tabelle2!$A:$I,C$2,FALSE),\"\"))","v":"-"},{"$f":"IF(OR(C69=\"\",C69=\"-\"),\"\",IFERROR(VLOOKUP($A69,[1]Tabelle2!$A:$I,D$2,FALSE),\"\"))","v":""},{"$f":"IF(OR(D69=\"\",D69=\"-\"),\"\",IFERROR(VLOOKUP($A69,[1]Tabelle2!$A:$I,E$2,FALSE),\"\"))","v":""},"",{"$f":"IFERROR(E69/F69,\"\")","v":""}]
["Nor-II-08-E2",{"$f":"IF(OR(A70=\"\",A70=\"-\"),\"\",IFERROR(VLOOKUP($A70,[1]Tabelle2!$A:$I,B$2,FALSE),\"\"))","v":"Gut Eschengrund"},{"$f":"IF(OR(B70=\"\",B70=\"-\"),\"\",IFERROR(VLOOKUP($A70,[1]Tabelle2!$A:$I,C$2,FALSE),\"\"))","v":"Anselm von Eschengrund "},{"$f":"IF(OR(C70=\"\",C70=\"-\"),\"\",IFERROR(VLOOKUP($A70,[1]Tabelle2!$A:$I,D$2,FALSE),\"\"))","v":0},{"$f":"IF(OR(D70=\"\",D70=\"-\"),\"\",IFERROR(VLOOKUP($A70,[1]Tabelle2!$A:$I,E$2,FALSE),\"\"))","v":0},0,""]
["Nor-II-08-E3",{"$f":"IF(OR(A71=\"\",A71=\"-\"),\"\",IFERROR(VLOOKUP($A71,[1]Tabelle2!$A:$I,B$2,FALSE),\"\"))","v":"Gut Moosgau"},{"$f":"IF(OR(B71=\"\",B71=\"-\"),\"\",IFERROR(VLOOKUP($A71,[1]Tabelle2!$A:$I,C$2,FALSE),\"\"))","v":"Rahjalin von Bösenbursch"},{"$f":"IF(OR(C71=\"\",C71=\"-\"),\"\",IFERROR(VLOOKUP($A71,[1]Tabelle2!$A:$I,D$2,FALSE),\"\"))","v":0},{"$f":"IF(OR(D71=\"\",D71=\"-\"),\"\",IFERROR(VLOOKUP($A71,[1]Tabelle2!$A:$I,E$2,FALSE),\"\"))","v":0},0,""]
["Nor-II-08-E4",{"$f":"IF(OR(A72=\"\",A72=\"-\"),\"\",IFERROR(VLOOKUP($A72,[1]Tabelle2!$A:$I,B$2,FALSE),\"\"))","v":"Gut Drakenswald"},{"$f":"IF(OR(B72=\"\",B72=\"-\"),\"\",IFERROR(VLOOKUP($A72,[1]Tabelle2!$A:$I,C$2,FALSE),\"\"))","v":"-"},{"$f":"IF(OR(C72=\"\",C72=\"-\"),\"\",IFERROR(VLOOKUP($A72,[1]Tabelle2!$A:$I,D$2,FALSE),\"\"))","v":""},{"$f":"IF(OR(D72=\"\",D72=\"-\"),\"\",IFERROR(VLOOKUP($A72,[1]Tabelle2!$A:$I,E$2,FALSE),\"\"))","v":""},"",""]
["Nor-II-08-E5",{"$f":"IF(OR(A73=\"\",A73=\"-\"),\"\",IFERROR(VLOOKUP($A73,[1]Tabelle2!$A:$I,B$2,FALSE),\"\"))","v":"Gut Krähenwald"},{"$f":"IF(OR(B73=\"\",B73=\"-\"),\"\",IFERROR(VLOOKUP($A73,[1]Tabelle2!$A:$I,C$2,FALSE),\"\"))","v":"-"},{"$f":"IF(OR(C73=\"\",C73=\"-\"),\"\",IFERROR(VLOOKUP($A73,[1]Tabelle2!$A:$I,D$2,FALSE),\"\"))","v":""},{"$f":"IF(OR(D73=\"\",D73=\"-\"),\"\",IFERROR(VLOOKUP($A73,[1]Tabelle2!$A:$I,E$2,FALSE),\"\"))","v":""},"",""]
["Nor-II-08-E6",{"$f":"IF(OR(A74=\"\",A74=\"-\"),\"\",IFERROR(VLOOKUP($A74,[1]Tabelle2!$A:$I,B$2,FALSE),\"\"))","v":"Edlengut Rickenbach"},{"$f":"IF(OR(B74=\"\",B74=\"-\"),\"\",IFERROR(VLOOKUP($A74,[1]Tabelle2!$A:$I,C$2,FALSE),\"\"))","v":"Edler Lupius von Schellenberg"},{"$f":"IF(OR(C74=\"\",C74=\"-\"),\"\",IFERROR(VLOOKUP($A74,[1]Tabelle2!$A:$I,D$2,FALSE),\"\"))","v":0},{"$f":"IF(OR(D74=\"\",D74=\"-\"),\"\",IFERROR(VLOOKUP($A74,[1]Tabelle2!$A:$I,E$2,FALSE),\"\"))","v":0},0,""]
["Nor-II-08-E7",{"$f":"IF(OR(A75=\"\",A75=\"-\"),\"\",IFERROR(VLOOKUP($A75,[1]Tabelle2!$A:$I,B$2,FALSE),\"\"))","v":"Edlengut Erdeschtal"},{"$f":"IF(OR(B75=\"\",B75=\"-\"),\"\",IFERROR(VLOOKUP($A75,[1]Tabelle2!$A:$I,C$2,FALSE),\"\"))","v":"Baron Rajodan von Keyserring"},{"$f":"IF(OR(C75=\"\",C75=\"-\"),\"\",IFERROR(VLOOKUP($A75,[1]Tabelle2!$A:$I,D$2,FALSE),\"\"))","v":0},{"$f":"IF(OR(D75=\"\",D75=\"-\"),\"\",IFERROR(VLOOKUP($A75,[1]Tabelle2!$A:$I,E$2,FALSE),\"\"))","v":0},0,""]
["Nor-II-08-E9",{"$f":"IF(OR(A76=\"\",A76=\"-\"),\"\",IFERROR(VLOOKUP($A76,[1]Tabelle2!$A:$I,B$2,FALSE),\"\"))","v":"Edlengut Hinterwald"},{"$f":"IF(OR(B76=\"\",B76=\"-\"),\"\",IFERROR(VLOOKUP($A76,[1]Tabelle2!$A:$I,C$2,FALSE),\"\"))","v":"Edler Vitold von Baldursstolz"},{"$f":"IF(OR(C76=\"\",C76=\"-\"),\"\",IFERROR(VLOOKUP($A76,[1]Tabelle2!$A:$I,D$2,FALSE),\"\"))","v":0},{"$f":"IF(OR(D76=\"\",D76=\"-\"),\"\",IFERROR(VLOOKUP($A76,[1]Tabelle2!$A:$I,E$2,FALSE),\"\"))","v":0},0,""]
["Nor-II-08-E10",{"$f":"IF(OR(A77=\"\",A77=\"-\"),\"\",IFERROR(VLOOKUP($A77,[1]Tabelle2!$A:$I,B$2,FALSE),\"\"))","v":"Edlengut Erd-Eschenwald"},{"$f":"IF(OR(B77=\"\",B77=\"-\"),\"\",IFERROR(VLOOKUP($A77,[1]Tabelle2!$A:$I,C$2,FALSE),\"\"))","v":"Edler Erlan von Borkenforst"},{"$f":"IF(OR(C77=\"\",C77=\"-\"),\"\",IFERROR(VLOOKUP($A77,[1]Tabelle2!$A:$I,D$2,FALSE),\"\"))","v":0},{"$f":"IF(OR(D77=\"\",D77=\"-\"),\"\",IFERROR(VLOOKUP($A77,[1]Tabelle2!$A:$I,E$2,FALSE),\"\"))","v":0},0,""]
["Nor-II-08-E11",{"$f":"IF(OR(A78=\"\",A78=\"-\"),\"\",IFERROR(VLOOKUP($A78,[1]Tabelle2!$A:$I,B$2,FALSE),\"\"))","v":"Edlengut Breewald"},{"$f":"IF(OR(B78=\"\",B78=\"-\"),\"\",IFERROR(VLOOKUP($A78,[1]Tabelle2!$A:$I,C$2,FALSE),\"\"))","v":"Edler Noitburg von Rechklamm"},{"$f":"IF(OR(C78=\"\",C78=\"-\"),\"\",IFERROR(VLOOKUP($A78,[1]Tabelle2!$A:$I,D$2,FALSE),\"\"))","v":0},{"$f":"IF(OR(D78=\"\",D78=\"-\"),\"\",IFERROR(VLOOKUP($A78,[1]Tabelle2!$A:$I,E$2,FALSE),\"\"))","v":0},0,""]
["Nor-II-08-E12",{"$f":"IF(OR(A79=\"\",A79=\"-\"),\"\",IFERROR(VLOOKUP($A79,[1]Tabelle2!$A:$I,B$2,FALSE),\"\"))","v":"Edlengut Burg Eisenstein"},{"$f":"IF(OR(B79=\"\",B79=\"-\"),\"\",IFERROR(VLOOKUP($A79,[1]Tabelle2!$A:$I,C$2,FALSE),\"\"))","v":"Edler Gorwin von Eisenstein-Schleiffenröchte"},{"$f":"IF(OR(C79=\"\",C79=\"-\"),\"\",IFERROR(VLOOKUP($A79,[1]Tabelle2!$A:$I,D$2,FALSE),\"\"))","v":0},{"$f":"IF(OR(D79=\"\",D79=\"-\"),\"\",IFERROR(VLOOKUP($A79,[1]Tabelle2!$A:$I,E$2,FALSE),\"\"))","v":0},0,""]
["Nor-II-09aR ",{"$f":"IF(OR(A80=\"\",A80=\"-\"),\"\",IFERROR(VLOOKUP($A80,[1]Tabelle2!$A:$I,B$2,FALSE),\"\"))","v":"Baronie Eisenhuett "},{"$f":"IF(OR(B80=\"\",B80=\"-\"),\"\",IFERROR(VLOOKUP($A80,[1]Tabelle2!$A:$I,C$2,FALSE),\"\"))","v":"Vogt Jast Godehard von Schleiffenröchte / Ehemals Baron Roderich Siegbert v. Quakenbrück bis zu dessen Flucht 1037 BF "},{"$f":"IF(OR(C80=\"\",C80=\"-\"),\"\",IFERROR(VLOOKUP($A80,[1]Tabelle2!$A:$I,D$2,FALSE),\"\"))","v":10300},{"$f":"IF(OR(D80=\"\",D80=\"-\"),\"\",IFERROR(VLOOKUP($A80,[1]Tabelle2!$A:$I,E$2,FALSE),\"\"))","v":50},10350,4.830917874396135E-3]
["Nor-II-09b",{"$f":"IF(OR(A81=\"\",A81=\"-\"),\"\",IFERROR(VLOOKUP($A81,[1]Tabelle2!$A:$I,B$2,FALSE),\"\"))","v":"Reichsstadt Eisenhuett "},{"$f":"IF(OR(B81=\"\",B81=\"-\"),\"\",IFERROR(VLOOKUP($A81,[1]Tabelle2!$A:$I,C$2,FALSE),\"\"))","v":"Kaiserin Rohaja von Gareth, vertreten durch Stadtmeister Gneiserich Obersperger "},{"$f":"IF(OR(C81=\"\",C81=\"-\"),\"\",IFERROR(VLOOKUP($A81,[1]Tabelle2!$A:$I,D$2,FALSE),\"\"))","v":690},{"$f":"IF(OR(D81=\"\",D81=\"-\"),\"\",IFERROR(VLOOKUP($A81,[1]Tabelle2!$A:$I,E$2,FALSE),\"\"))","v":30},720,4.1666666666666664E-2]
["-",{"$f":"IF(OR(A82=\"\",A82=\"-\"),\"\",IFERROR(VLOOKUP($A82,[1]Tabelle2!$A:$I,B$2,FALSE),\"\"))","v":""},{"$f":"IF(OR(B82=\"\",B82=\"-\"),\"\",IFERROR(VLOOKUP($A82,[1]Tabelle2!$A:$I,C$2,FALSE),\"\"))","v":""},{"$f":"IF(OR(C82=\"\",C82=\"-\"),\"\",IFERROR(VLOOKUP($A82,[1]Tabelle2!$A:$I,D$2,FALSE),\"\"))","v":""},{"$f":"IF(OR(D82=\"\",D82=\"-\"),\"\",IFERROR(VLOOKUP($A82,[1]Tabelle2!$A:$I,E$2,FALSE),\"\"))","v":""},"",""]
["Nor-II-09-E1",{"$f":"IF(OR(A83=\"\",A83=\"-\"),\"\",IFERROR(VLOOKUP($A83,[1]Tabelle2!$A:$I,B$2,FALSE),\"\"))","v":"Gut Quakenbrück"},{"$f":"IF(OR(B83=\"\",B83=\"-\"),\"\",IFERROR(VLOOKUP($A83,[1]Tabelle2!$A:$I,C$2,FALSE),\"\"))","v":"Roderich Siegberg von und zu Quakenbrück"},{"$f":"IF(OR(C83=\"\",C83=\"-\"),\"\",IFERROR(VLOOKUP($A83,[1]Tabelle2!$A:$I,D$2,FALSE),\"\"))","v":0},{"$f":"IF(OR(D83=\"\",D83=\"-\"),\"\",IFERROR(VLOOKUP($A83,[1]Tabelle2!$A:$I,E$2,FALSE),\"\"))","v":0},0,""]
["Nor-II-09-E2",{"$f":"IF(OR(A84=\"\",A84=\"-\"),\"\",IFERROR(VLOOKUP($A84,[1]Tabelle2!$A:$I,B$2,FALSE),\"\"))","v":"Gut Schrazelroth"},{"$f":"IF(OR(B84=\"\",B84=\"-\"),\"\",IFERROR(VLOOKUP($A84,[1]Tabelle2!$A:$I,C$2,FALSE),\"\"))","v":"Darian von Lifstein"},{"$f":"IF(OR(C84=\"\",C84=\"-\"),\"\",IFERROR(VLOOKUP($A84,[1]Tabelle2!$A:$I,D$2,FALSE),\"\"))","v":370},{"$f":"IF(OR(D84=\"\",D84=\"-\"),\"\",IFERROR(VLOOKUP($A84,[1]Tabelle2!$A:$I,E$2,FALSE),\"\"))","v":0},370,0]
["Nor-II-09-E3",{"$f":"IF(OR(A85=\"\",A85=\"-\"),\"\",IFERROR(VLOOKUP($A85,[1]Tabelle2!$A:$I,B$2,FALSE),\"\"))","v":"Gut Garstenborn"},{"$f":"IF(OR(B85=\"\",B85=\"-\"),\"\",IFERROR(VLOOKUP($A85,[1]Tabelle2!$A:$I,C$2,FALSE),\"\"))","v":"-"},{"$f":"IF(OR(C85=\"\",C85=\"-\"),\"\",IFERROR(VLOOKUP($A85,[1]Tabelle2!$A:$I,D$2,FALSE),\"\"))","v":""},{"$f":"IF(OR(D85=\"\",D85=\"-\"),\"\",IFERROR(VLOOKUP($A85,[1]Tabelle2!$A:$I,E$2,FALSE),\"\"))","v":""},"",""]
["Nor-II-09-E4",{"$f":"IF(OR(A86=\"\",A86=\"-\"),\"\",IFERROR(VLOOKUP($A86,[1]Tabelle2!$A:$I,B$2,FALSE),\"\"))","v":"Rittergut Schwarzklamm"},{"$f":"IF(OR(B86=\"\",B86=\"-\"),\"\",IFERROR(VLOOKUP($A86,[1]Tabelle2!$A:$I,C$2,FALSE),\"\"))","v":"Hadebrand von Harthals-Schwarzklamm"},{"$f":"IF(OR(C86=\"\",C86=\"-\"),\"\",IFERROR(VLOOKUP($A86,[1]Tabelle2!$A:$I,D$2,FALSE),\"\"))","v":0},{"$f":"IF(OR(D86=\"\",D86=\"-\"),\"\",IFERROR(VLOOKUP($A86,[1]Tabelle2!$A:$I,E$2,FALSE),\"\"))","v":0},0,""]
["Nor-II-09-E5",{"$f":"IF(OR(A87=\"\",A87=\"-\"),\"\",IFERROR(VLOOKUP($A87,[1]Tabelle2!$A:$I,B$2,FALSE),\"\"))","v":"Gut Krotenau"},{"$f":"IF(OR(B87=\"\",B87=\"-\"),\"\",IFERROR(VLOOKUP($A87,[1]Tabelle2!$A:$I,C$2,FALSE),\"\"))","v":"Greifhold von Krotenau"},{"$f":"IF(OR(C87=\"\",C87=\"-\"),\"\",IFERROR(VLOOKUP($A87,[1]Tabelle2!$A:$I,D$2,FALSE),\"\"))","v":" "},{"$f":"IF(OR(D87=\"\",D87=\"-\"),\"\",IFERROR(VLOOKUP($A87,[1]Tabelle2!$A:$I,E$2,FALSE),\"\"))","v":" "},"",""]
["Nor-II-09-J1",{"$f":"IF(OR(A88=\"\",A88=\"-\"),\"\",IFERROR(VLOOKUP($A88,[1]Tabelle2!$A:$I,B$2,FALSE),\"\"))","v":"Junkergut Lanzenberg "},{"$f":"IF(OR(B88=\"\",B88=\"-\"),\"\",IFERROR(VLOOKUP($A88,[1]Tabelle2!$A:$I,C$2,FALSE),\"\"))","v":"Junker Alvaro Cyprian ya Mornicala zu Lanzenberg "},{"$f":"IF(OR(C88=\"\",C88=\"-\"),\"\",IFERROR(VLOOKUP($A88,[1]Tabelle2!$A:$I,D$2,FALSE),\"\"))","v":" "},{"$f":"IF(OR(D88=\"\",D88=\"-\"),\"\",IFERROR(VLOOKUP($A88,[1]Tabelle2!$A:$I,E$2,FALSE),\"\"))","v":" "},"",""]
["Nor-II-10BK",{"$f":"IF(OR(A89=\"\",A89=\"-\"),\"\",IFERROR(VLOOKUP($A89,[1]Tabelle2!$A:$I,B$2,FALSE),\"\"))","v":"Bergfreiheit Eisenwald "},{"$f":"IF(OR(B89=\"\",B89=\"-\"),\"\",IFERROR(VLOOKUP($A89,[1]Tabelle2!$A:$I,C$2,FALSE),\"\"))","v":"Bergkönig Fargol Sohn des Fanderam von Eisenwald "},{"$f":"IF(OR(C89=\"\",C89=\"-\"),\"\",IFERROR(VLOOKUP($A89,[1]Tabelle2!$A:$I,D$2,FALSE),\"\"))","v":3200},{"$f":"IF(OR(D89=\"\",D89=\"-\"),\"\",IFERROR(VLOOKUP($A89,[1]Tabelle2!$A:$I,E$2,FALSE),\"\"))","v":1600},4800,0.33333333333333331]
["-",{"$f":"IF(OR(A90=\"\",A90=\"-\"),\"\",IFERROR(VLOOKUP($A90,[1]Tabelle2!$A:$I,B$2,FALSE),\"\"))","v":""},{"$f":"IF(OR(B90=\"\",B90=\"-\"),\"\",IFERROR(VLOOKUP($A90,[1]Tabelle2!$A:$I,C$2,FALSE),\"\"))","v":""},{"$f":"IF(OR(C90=\"\",C90=\"-\"),\"\",IFERROR(VLOOKUP($A90,[1]Tabelle2!$A:$I,D$2,FALSE),\"\"))","v":""},{"$f":"IF(OR(D90=\"\",D90=\"-\"),\"\",IFERROR(VLOOKUP($A90,[1]Tabelle2!$A:$I,E$2,FALSE),\"\"))","v":""},"",""]
["Nor-II-10BK",{"$f":"IF(OR(A91=\"\",A91=\"-\"),\"\",IFERROR(VLOOKUP($A91,[1]Tabelle2!$A:$I,B$2,FALSE),\"\"))","v":"Bergfreiheit Eisenwald "},{"$f":"IF(OR(B91=\"\",B91=\"-\"),\"\",IFERROR(VLOOKUP($A91,[1]Tabelle2!$A:$I,C$2,FALSE),\"\"))","v":"Bergkönig Fargol Sohn des Fanderam von Eisenwald "},{"$f":"IF(OR(C91=\"\",C91=\"-\"),\"\",IFERROR(VLOOKUP($A91,[1]Tabelle2!$A:$I,D$2,FALSE),\"\"))","v":3200},{"$f":"IF(OR(D91=\"\",D91=\"-\"),\"\",IFERROR(VLOOKUP($A91,[1]Tabelle2!$A:$I,E$2,FALSE),\"\"))","v":1600},4800,0.33333333333333331]
["Nor-II-10BK-E1",{"$f":"IF(OR(A92=\"\",A92=\"-\"),\"\",IFERROR(VLOOKUP($A92,[1]Tabelle2!$A:$I,B$2,FALSE),\"\"))","v":"Edlengut Nilsitz"},{"$f":"IF(OR(B92=\"\",B92=\"-\"),\"\",IFERROR(VLOOKUP($A92,[1]Tabelle2!$A:$I,C$2,FALSE),\"\"))","v":"Edle Rhela von Nilsitz "},{"$f":"IF(OR(C92=\"\",C92=\"-\"),\"\",IFERROR(VLOOKUP($A92,[1]Tabelle2!$A:$I,D$2,FALSE),\"\"))","v":0},{"$f":"IF(OR(D92=\"\",D92=\"-\"),\"\",IFERROR(VLOOKUP($A92,[1]Tabelle2!$A:$I,E$2,FALSE),\"\"))","v":0},0,""]
["Nor-II-10BK-E2",{"$f":"IF(OR(A93=\"\",A93=\"-\"),\"\",IFERROR(VLOOKUP($A93,[1]Tabelle2!$A:$I,B$2,FALSE),\"\"))","v":"Edlengut Sturzenstein"},{"$f":"IF(OR(B93=\"\",B93=\"-\"),\"\",IFERROR(VLOOKUP($A93,[1]Tabelle2!$A:$I,C$2,FALSE),\"\"))","v":"Kalvar Kupferfeld zu Sturzenstein"},{"$f":"IF(OR(C93=\"\",C93=\"-\"),\"\",IFERROR(VLOOKUP($A93,[1]Tabelle2!$A:$I,D$2,FALSE),\"\"))","v":0},{"$f":"IF(OR(D93=\"\",D93=\"-\"),\"\",IFERROR(VLOOKUP($A93,[1]Tabelle2!$A:$I,E$2,FALSE),\"\"))","v":0},0,""]
["Nor-II-10BK-E3",{"$f":"IF(OR(A94=\"\",A94=\"-\"),\"\",IFERROR(VLOOKUP($A94,[1]Tabelle2!$A:$I,B$2,FALSE),\"\"))","v":"Bergwacht Ishna‘Mur"},{"$f":"IF(OR(B94=\"\",B94=\"-\"),\"\",IFERROR(VLOOKUP($A94,[1]Tabelle2!$A:$I,C$2,FALSE),\"\"))","v":"Bergvogt Borix Sohn des Barax"},{"$f":"IF(OR(C94=\"\",C94=\"-\"),\"\",IFERROR(VLOOKUP($A94,[1]Tabelle2!$A:$I,D$2,FALSE),\"\"))","v":0},{"$f":"IF(OR(D94=\"\",D94=\"-\"),\"\",IFERROR(VLOOKUP($A94,[1]Tabelle2!$A:$I,E$2,FALSE),\"\"))","v":100},100,1]
["Nor-II-10BK-J1",{"$f":"IF(OR(A95=\"\",A95=\"-\"),\"\",IFERROR(VLOOKUP($A95,[1]Tabelle2!$A:$I,B$2,FALSE),\"\"))","v":"Burg Trollpforz "},{"$f":"IF(OR(B95=\"\",B95=\"-\"),\"\",IFERROR(VLOOKUP($A95,[1]Tabelle2!$A:$I,C$2,FALSE),\"\"))","v":"Jungfer Talina von Trollpforz "},{"$f":"IF(OR(C95=\"\",C95=\"-\"),\"\",IFERROR(VLOOKUP($A95,[1]Tabelle2!$A:$I,D$2,FALSE),\"\"))","v":0},{"$f":"IF(OR(D95=\"\",D95=\"-\"),\"\",IFERROR(VLOOKUP($A95,[1]Tabelle2!$A:$I,E$2,FALSE),\"\"))","v":" "},"",""]
["Nor-II-11 ",{"$f":"IF(OR(A96=\"\",A96=\"-\"),\"\",IFERROR(VLOOKUP($A96,[1]Tabelle2!$A:$I,B$2,FALSE),\"\"))","v":"Baronie Rabenstein "},{"$f":"IF(OR(B96=\"\",B96=\"-\"),\"\",IFERROR(VLOOKUP($A96,[1]Tabelle2!$A:$I,C$2,FALSE),\"\"))","v":"Baron Lucrann v.Rabenstein zu Rabenstein "},{"$f":"IF(OR(C96=\"\",C96=\"-\"),\"\",IFERROR(VLOOKUP($A96,[1]Tabelle2!$A:$I,D$2,FALSE),\"\"))","v":2300},{"$f":"IF(OR(D96=\"\",D96=\"-\"),\"\",IFERROR(VLOOKUP($A96,[1]Tabelle2!$A:$I,E$2,FALSE),\"\"))","v":350},2650,0.13207547169811321]
["Nor-II-11 ",{"$f":"IF(OR(A97=\"\",A97=\"-\"),\"\",IFERROR(VLOOKUP($A97,[1]Tabelle2!$A:$I,B$2,FALSE),\"\"))","v":"Baronie Rabenstein "},{"$f":"IF(OR(B97=\"\",B97=\"-\"),\"\",IFERROR(VLOOKUP($A97,[1]Tabelle2!$A:$I,C$2,FALSE),\"\"))","v":"Baron Lucrann v.Rabenstein zu Rabenstein "},{"$f":"IF(OR(C97=\"\",C97=\"-\"),\"\",IFERROR(VLOOKUP($A97,[1]Tabelle2!$A:$I,D$2,FALSE),\"\"))","v":2300},{"$f":"IF(OR(D97=\"\",D97=\"-\"),\"\",IFERROR(VLOOKUP($A97,[1]Tabelle2!$A:$I,E$2,FALSE),\"\"))","v":350},2650,0.13207547169811321]
["Nor-II-11-E1",{"$f":"IF(OR(A98=\"\",A98=\"-\"),\"\",IFERROR(VLOOKUP($A98,[1]Tabelle2!$A:$I,B$2,FALSE),\"\"))","v":"Gut Finsterbach"},{"$f":"IF(OR(B98=\"\",B98=\"-\"),\"\",IFERROR(VLOOKUP($A98,[1]Tabelle2!$A:$I,C$2,FALSE),\"\"))","v":"Domänengut des Barons"},{"$f":"IF(OR(C98=\"\",C98=\"-\"),\"\",IFERROR(VLOOKUP($A98,[1]Tabelle2!$A:$I,D$2,FALSE),\"\"))","v":400},{"$f":"IF(OR(D98=\"\",D98=\"-\"),\"\",IFERROR(VLOOKUP($A98,[1]Tabelle2!$A:$I,E$2,FALSE),\"\"))","v":50},450,0.1111111111111111]
["Nor-II-11-E2",{"$f":"IF(OR(A99=\"\",A99=\"-\"),\"\",IFERROR(VLOOKUP($A99,[1]Tabelle2!$A:$I,B$2,FALSE),\"\"))","v":"Dorf Isenbrück "},{"$f":"IF(OR(B99=\"\",B99=\"-\"),\"\",IFERROR(VLOOKUP($A99,[1]Tabelle2!$A:$I,C$2,FALSE),\"\"))","v":"Kirchenbesitz, Richild von Moorbrück für den Orden des Hl. Golgari"},{"$f":"IF(OR(C99=\"\",C99=\"-\"),\"\",IFERROR(VLOOKUP($A99,[1]Tabelle2!$A:$I,D$2,FALSE),\"\"))","v":100},{"$f":"IF(OR(D99=\"\",D99=\"-\"),\"\",IFERROR(VLOOKUP($A99,[1]Tabelle2!$A:$I,E$2,FALSE),\"\"))","v":0},100,0]
["Nor-II-11-E3",{"$f":"IF(OR(A100=\"\",A100=\"-\"),\"\",IFERROR(VLOOKUP($A100,[1]Tabelle2!$A:$I,B$2,FALSE),\"\"))","v":"Burg Tannwacht"},{"$f":"IF(OR(B100=\"\",B100=\"-\"),\"\",IFERROR(VLOOKUP($A100,[1]Tabelle2!$A:$I,C$2,FALSE),\"\"))","v":"Odewin von Wolfsstein"},{"$f":"IF(OR(C100=\"\",C100=\"-\"),\"\",IFERROR(VLOOKUP($A100,[1]Tabelle2!$A:$I,D$2,FALSE),\"\"))","v":50},{"$f":"IF(OR(D100=\"\",D100=\"-\"),\"\",IFERROR(VLOOKUP($A100,[1]Tabelle2!$A:$I,E$2,FALSE),\"\"))","v":0},50,0]
["Nor-II-11-E4",{"$f":"IF(OR(A101=\"\",A101=\"-\"),\"\",IFERROR(VLOOKUP($A101,[1]Tabelle2!$A:$I,B$2,FALSE),\"\"))","v":"Gut Wolfstobel"},{"$f":"IF(OR(B101=\"\",B101=\"-\"),\"\",IFERROR(VLOOKUP($A101,[1]Tabelle2!$A:$I,C$2,FALSE),\"\"))","v":"Domänengut des Barons"},{"$f":"IF(OR(C101=\"\",C101=\"-\"),\"\",IFERROR(VLOOKUP($A101,[1]Tabelle2!$A:$I,D$2,FALSE),\"\"))","v":0},{"$f":"IF(OR(D101=\"\",D101=\"-\"),\"\",IFERROR(VLOOKUP($A101,[1]Tabelle2!$A:$I,E$2,FALSE),\"\"))","v":0},0,""]
["Nor-II-11-E5",{"$f":"IF(OR(A102=\"\",A102=\"-\"),\"\",IFERROR(VLOOKUP($A102,[1]Tabelle2!$A:$I,B$2,FALSE),\"\"))","v":"Gut Schwarzthann"},{"$f":"IF(OR(B102=\"\",B102=\"-\"),\"\",IFERROR(VLOOKUP($A102,[1]Tabelle2!$A:$I,C$2,FALSE),\"\"))","v":"Domänengut des Barons"},{"$f":"IF(OR(C102=\"\",C102=\"-\"),\"\",IFERROR(VLOOKUP($A102,[1]Tabelle2!$A:$I,D$2,FALSE),\"\"))","v":200},{"$f":"IF(OR(D102=\"\",D102=\"-\"),\"\",IFERROR(VLOOKUP($A102,[1]Tabelle2!$A:$I,E$2,FALSE),\"\"))","v":0},200,0]
["Nor-II-11-E6",{"$f":"IF(OR(A103=\"\",A103=\"-\"),\"\",IFERROR(VLOOKUP($A103,[1]Tabelle2!$A:$I,B$2,FALSE),\"\"))","v":"Gut Finsterkamm"},{"$f":"IF(OR(B103=\"\",B103=\"-\"),\"\",IFERROR(VLOOKUP($A103,[1]Tabelle2!$A:$I,C$2,FALSE),\"\"))","v":"Edler Wolfhelm von Winterspitz zu Finsterkamm"},{"$f":"IF(OR(C103=\"\",C103=\"-\"),\"\",IFERROR(VLOOKUP($A103,[1]Tabelle2!$A:$I,D$2,FALSE),\"\"))","v":300},{"$f":"IF(OR(D103=\"\",D103=\"-\"),\"\",IFERROR(VLOOKUP($A103,[1]Tabelle2!$A:$I,E$2,FALSE),\"\"))","v":0},300,0]
["Nor-II-11-E7",{"$f":"IF(OR(A104=\"\",A104=\"-\"),\"\",IFERROR(VLOOKUP($A104,[1]Tabelle2!$A:$I,B$2,FALSE),\"\"))","v":"Gut Erzklamm"},{"$f":"IF(OR(B104=\"\",B104=\"-\"),\"\",IFERROR(VLOOKUP($A104,[1]Tabelle2!$A:$I,C$2,FALSE),\"\"))","v":"Baron Lucrann von Rabenstein "},{"$f":"IF(OR(C104=\"\",C104=\"-\"),\"\",IFERROR(VLOOKUP($A104,[1]Tabelle2!$A:$I,D$2,FALSE),\"\"))","v":250},{"$f":"IF(OR(D104=\"\",D104=\"-\"),\"\",IFERROR(VLOOKUP($A104,[1]Tabelle2!$A:$I,E$2,FALSE),\"\"))","v":" "},"",""]
["Nor-II-12 ",{"$f":"IF(OR(A105=\"\",A105=\"-\"),\"\",IFERROR(VLOOKUP($A105,[1]Tabelle2!$A:$I,B$2,FALSE),\"\"))","v":"Baronie Dohlenfelde "},{"$f":"IF(OR(B105=\"\",B105=\"-\"),\"\",IFERROR(VLOOKUP($A105,[1]Tabelle2!$A:$I,C$2,FALSE),\"\"))","v":"Vögtin Celissa von Fallenwerth, vormals Baron Angrond Bernhelm von Sturmfels m.H. bis zu dessen Flucht 1037 BF"},{"$f":"IF(OR(C105=\"\",C105=\"-\"),\"\",IFERROR(VLOOKUP($A105,[1]Tabelle2!$A:$I,D$2,FALSE),\"\"))","v":5800},{"$f":"IF(OR(D105=\"\",D105=\"-\"),\"\",IFERROR(VLOOKUP($A105,[1]Tabelle2!$A:$I,E$2,FALSE),\"\"))","v":550},6350,8.6614173228346455E-2]
["Nor-II-12-P",{"$f":"IF(OR(A106=\"\",A106=\"-\"),\"\",IFERROR(VLOOKUP($A106,[1]Tabelle2!$A:$I,B$2,FALSE),\"\"))","v":"Herzogenstadt Twergenhausen"},{"$f":"IF(OR(B106=\"\",B106=\"-\"),\"\",IFERROR(VLOOKUP($A106,[1]Tabelle2!$A:$I,C$2,FALSE),\"\"))","v":"Herzog Hagrobald Guntwin vom Großen Fluss, vertreten durch Bürgermeister Perval Gliependiek"},{"$f":"IF(OR(C106=\"\",C106=\"-\"),\"\",IFERROR(VLOOKUP($A106,[1]Tabelle2!$A:$I,D$2,FALSE),\"\"))","v":1120},{"$f":"IF(OR(D106=\"\",D106=\"-\"),\"\",IFERROR(VLOOKUP($A106,[1]Tabelle2!$A:$I,E$2,FALSE),\"\"))","v":80},1200,6.6666666666666666E-2]
["Nor-II-12 ",{"$f":"IF(OR(A107=\"\",A107=\"-\"),\"\",IFERROR(VLOOKUP($A107,[1]Tabelle2!$A:$I,B$2,FALSE),\"\"))","v":"Baronie Dohlenfelde "},{"$f":"IF(OR(B107=\"\",B107=\"-\"),\"\",IFERROR(VLOOKUP($A107,[1]Tabelle2!$A:$I,C$2,FALSE),\"\"))","v":"Vögtin Celissa von Fallenwerth, vormals Baron Angrond Bernhelm von Sturmfels m.H. bis zu dessen Flucht 1037 BF"},{"$f":"IF(OR(C107=\"\",C107=\"-\"),\"\",IFERROR(VLOOKUP($A107,[1]Tabelle2!$A:$I,D$2,FALSE),\"\"))","v":5800},{"$f":"IF(OR(D107=\"\",D107=\"-\"),\"\",IFERROR(VLOOKUP($A107,[1]Tabelle2!$A:$I,E$2,FALSE),\"\"))","v":550},6350,8.6614173228346455E-2]
["Nor-II-12-BG1",{"$f":"IF(OR(A108=\"\",A108=\"-\"),\"\",IFERROR(VLOOKUP($A108,[1]Tabelle2!$A:$I,B$2,FALSE),\"\"))","v":"Bergkönigsgut Loxolosch"},{"$f":"IF(OR(B108=\"\",B108=\"-\"),\"\",IFERROR(VLOOKUP($A108,[1]Tabelle2!$A:$I,C$2,FALSE),\"\"))","v":"Sippenrat"},{"$f":"IF(OR(C108=\"\",C108=\"-\"),\"\",IFERROR(VLOOKUP($A108,[1]Tabelle2!$A:$I,D$2,FALSE),\"\"))","v":0},{"$f":"IF(OR(D108=\"\",D108=\"-\"),\"\",IFERROR(VLOOKUP($A108,[1]Tabelle2!$A:$I,E$2,FALSE),\"\"))","v":0},0,""]
["Nor-II-12-BG2",{"$f":"IF(OR(A109=\"\",A109=\"-\"),\"\",IFERROR(VLOOKUP($A109,[1]Tabelle2!$A:$I,B$2,FALSE),\"\"))","v":"Berkönigsgut Grambosch"},{"$f":"IF(OR(B109=\"\",B109=\"-\"),\"\",IFERROR(VLOOKUP($A109,[1]Tabelle2!$A:$I,C$2,FALSE),\"\"))","v":"Sippenrat"},{"$f":"IF(OR(C109=\"\",C109=\"-\"),\"\",IFERROR(VLOOKUP($A109,[1]Tabelle2!$A:$I,D$2,FALSE),\"\"))","v":0},{"$f":"IF(OR(D109=\"\",D109=\"-\"),\"\",IFERROR(VLOOKUP($A109,[1]Tabelle2!$A:$I,E$2,FALSE),\"\"))","v":0},0,""]
["Nor-II-12-BG3",{"$f":"IF(OR(A110=\"\",A110=\"-\"),\"\",IFERROR(VLOOKUP($A110,[1]Tabelle2!$A:$I,B$2,FALSE),\"\"))","v":"Bergkönigsgut Arigalatiko"},{"$f":"IF(OR(B110=\"\",B110=\"-\"),\"\",IFERROR(VLOOKUP($A110,[1]Tabelle2!$A:$I,C$2,FALSE),\"\"))","v":"Sippenrat"},{"$f":"IF(OR(C110=\"\",C110=\"-\"),\"\",IFERROR(VLOOKUP($A110,[1]Tabelle2!$A:$I,D$2,FALSE),\"\"))","v":0},{"$f":"IF(OR(D110=\"\",D110=\"-\"),\"\",IFERROR(VLOOKUP($A110,[1]Tabelle2!$A:$I,E$2,FALSE),\"\"))","v":0},0,""]
["Nor-II-12-E1 ",{"$f":"IF(OR(A111=\"\",A111=\"-\"),\"\",IFERROR(VLOOKUP($A111,[1]Tabelle2!$A:$I,B$2,FALSE),\"\"))","v":"Edlengut Wolkenfold "},{"$f":"IF(OR(B111=\"\",B111=\"-\"),\"\",IFERROR(VLOOKUP($A111,[1]Tabelle2!$A:$I,C$2,FALSE),\"\"))","v":"Edle Roana von Schwarzfels "},{"$f":"IF(OR(C111=\"\",C111=\"-\"),\"\",IFERROR(VLOOKUP($A111,[1]Tabelle2!$A:$I,D$2,FALSE),\"\"))","v":0},{"$f":"IF(OR(D111=\"\",D111=\"-\"),\"\",IFERROR(VLOOKUP($A111,[1]Tabelle2!$A:$I,E$2,FALSE),\"\"))","v":0},0,""]
["Nor-II-12-E2",{"$f":"IF(OR(A112=\"\",A112=\"-\"),\"\",IFERROR(VLOOKUP($A112,[1]Tabelle2!$A:$I,B$2,FALSE),\"\"))","v":"Gräfliches Edlengut Moxarosch"},{"$f":"IF(OR(B112=\"\",B112=\"-\"),\"\",IFERROR(VLOOKUP($A112,[1]Tabelle2!$A:$I,C$2,FALSE),\"\"))","v":"Edle Girte von Fallenwerth"},{"$f":"IF(OR(C112=\"\",C112=\"-\"),\"\",IFERROR(VLOOKUP($A112,[1]Tabelle2!$A:$I,D$2,FALSE),\"\"))","v":0},{"$f":"IF(OR(D112=\"\",D112=\"-\"),\"\",IFERROR(VLOOKUP($A112,[1]Tabelle2!$A:$I,E$2,FALSE),\"\"))","v":0},0,""]
["Nor-II-12-E3",{"$f":"IF(OR(A113=\"\",A113=\"-\"),\"\",IFERROR(VLOOKUP($A113,[1]Tabelle2!$A:$I,B$2,FALSE),\"\"))","v":"Freiherrlich Dohlenfelde (cisdarlinischer Teil)"},{"$f":"IF(OR(B113=\"\",B113=\"-\"),\"\",IFERROR(VLOOKUP($A113,[1]Tabelle2!$A:$I,C$2,FALSE),\"\"))","v":"Baron Angrond Bernhelm von Sturmfels m.H. "},{"$f":"IF(OR(C113=\"\",C113=\"-\"),\"\",IFERROR(VLOOKUP($A113,[1]Tabelle2!$A:$I,D$2,FALSE),\"\"))","v":0},{"$f":"IF(OR(D113=\"\",D113=\"-\"),\"\",IFERROR(VLOOKUP($A113,[1]Tabelle2!$A:$I,E$2,FALSE),\"\"))","v":0},0,""]
["Nor-II-12-E4",{"$f":"IF(OR(A114=\"\",A114=\"-\"),\"\",IFERROR(VLOOKUP($A114,[1]Tabelle2!$A:$I,B$2,FALSE),\"\"))","v":"Freiherrlich Dohlenfelde (transdarlinischer Teil)"},{"$f":"IF(OR(B114=\"\",B114=\"-\"),\"\",IFERROR(VLOOKUP($A114,[1]Tabelle2!$A:$I,C$2,FALSE),\"\"))","v":"Baron Angrond Bernhelm von Sturmfels m.H. "},{"$f":"IF(OR(C114=\"\",C114=\"-\"),\"\",IFERROR(VLOOKUP($A114,[1]Tabelle2!$A:$I,D$2,FALSE),\"\"))","v":0},{"$f":"IF(OR(D114=\"\",D114=\"-\"),\"\",IFERROR(VLOOKUP($A114,[1]Tabelle2!$A:$I,E$2,FALSE),\"\"))","v":0},0,""]
["Nor-II-12-E5",{"$f":"IF(OR(A115=\"\",A115=\"-\"),\"\",IFERROR(VLOOKUP($A115,[1]Tabelle2!$A:$I,B$2,FALSE),\"\"))","v":"Rittergut Darilstein"},{"$f":"IF(OR(B115=\"\",B115=\"-\"),\"\",IFERROR(VLOOKUP($A115,[1]Tabelle2!$A:$I,C$2,FALSE),\"\"))","v":"Ritter Markward von und zu Darilstein"},{"$f":"IF(OR(C115=\"\",C115=\"-\"),\"\",IFERROR(VLOOKUP($A115,[1]Tabelle2!$A:$I,D$2,FALSE),\"\"))","v":0},{"$f":"IF(OR(D115=\"\",D115=\"-\"),\"\",IFERROR(VLOOKUP($A115,[1]Tabelle2!$A:$I,E$2,FALSE),\"\"))","v":0},0,""]
["Nor-II-12-E6",{"$f":"IF(OR(A116=\"\",A116=\"-\"),\"\",IFERROR(VLOOKUP($A116,[1]Tabelle2!$A:$I,B$2,FALSE),\"\"))","v":"Gut Perainshof"},{"$f":"IF(OR(B116=\"\",B116=\"-\"),\"\",IFERROR(VLOOKUP($A116,[1]Tabelle2!$A:$I,C$2,FALSE),\"\"))","v":"vakant"},{"$f":"IF(OR(C116=\"\",C116=\"-\"),\"\",IFERROR(VLOOKUP($A116,[1]Tabelle2!$A:$I,D$2,FALSE),\"\"))","v":0},{"$f":"IF(OR(D116=\"\",D116=\"-\"),\"\",IFERROR(VLOOKUP($A116,[1]Tabelle2!$A:$I,E$2,FALSE),\"\"))","v":0},0,""]
["Nor-II-12-E7",{"$f":"IF(OR(A117=\"\",A117=\"-\"),\"\",IFERROR(VLOOKUP($A117,[1]Tabelle2!$A:$I,B$2,FALSE),\"\"))","v":"Rittergut Freyen"},{"$f":"IF(OR(B117=\"\",B117=\"-\"),\"\",IFERROR(VLOOKUP($A117,[1]Tabelle2!$A:$I,C$2,FALSE),\"\"))","v":"Ritterin Wilgunde von Nadelfels"},{"$f":"IF(OR(C117=\"\",C117=\"-\"),\"\",IFERROR(VLOOKUP($A117,[1]Tabelle2!$A:$I,D$2,FALSE),\"\"))","v":" "},{"$f":"IF(OR(D117=\"\",D117=\"-\"),\"\",IFERROR(VLOOKUP($A117,[1]Tabelle2!$A:$I,E$2,FALSE),\"\"))","v":0},"",""]
["Nor-II-12-J1 ",{"$f":"IF(OR(A118=\"\",A118=\"-\"),\"\",IFERROR(VLOOKUP($A118,[1]Tabelle2!$A:$I,B$2,FALSE),\"\"))","v":"Landedlengut Zwackelfegen "},{"$f":"IF(OR(B118=\"\",B118=\"-\"),\"\",IFERROR(VLOOKUP($A118,[1]Tabelle2!$A:$I,C$2,FALSE),\"\"))","v":"Aedin von Naris auf Zwackelfegen "},{"$f":"IF(OR(C118=\"\",C118=\"-\"),\"\",IFERROR(VLOOKUP($A118,[1]Tabelle2!$A:$I,D$2,FALSE),\"\"))","v":0},{"$f":"IF(OR(D118=\"\",D118=\"-\"),\"\",IFERROR(VLOOKUP($A118,[1]Tabelle2!$A:$I,E$2,FALSE),\"\"))","v":0},0,""]
["Nor-II-12-J2",{"$f":"IF(OR(A119=\"\",A119=\"-\"),\"\",IFERROR(VLOOKUP($A119,[1]Tabelle2!$A:$I,B$2,FALSE),\"\"))","v":"Landedlengut Wichtenfels "},{"$f":"IF(OR(B119=\"\",B119=\"-\"),\"\",IFERROR(VLOOKUP($A119,[1]Tabelle2!$A:$I,C$2,FALSE),\"\"))","v":"Voltan von Sturmfels m.H. "},{"$f":"IF(OR(C119=\"\",C119=\"-\"),\"\",IFERROR(VLOOKUP($A119,[1]Tabelle2!$A:$I,D$2,FALSE),\"\"))","v":0},{"$f":"IF(OR(D119=\"\",D119=\"-\"),\"\",IFERROR(VLOOKUP($A119,[1]Tabelle2!$A:$I,E$2,FALSE),\"\"))","v":0},0,""]
["Nor-II-12-J3",{"$f":"IF(OR(A120=\"\",A120=\"-\"),\"\",IFERROR(VLOOKUP($A120,[1]Tabelle2!$A:$I,B$2,FALSE),\"\"))","v":"Gut Erzweiler"},{"$f":"IF(OR(B120=\"\",B120=\"-\"),\"\",IFERROR(VLOOKUP($A120,[1]Tabelle2!$A:$I,C$2,FALSE),\"\"))","v":"Baron Angrond Bernhelm von Sturmfels m.H. "},{"$f":"IF(OR(C120=\"\",C120=\"-\"),\"\",IFERROR(VLOOKUP($A120,[1]Tabelle2!$A:$I,D$2,FALSE),\"\"))","v":0},{"$f":"IF(OR(D120=\"\",D120=\"-\"),\"\",IFERROR(VLOOKUP($A120,[1]Tabelle2!$A:$I,E$2,FALSE),\"\"))","v":0},0,""]
["Nor-III ",{"$f":"IF(OR(A121=\"\",A121=\"-\"),\"\",IFERROR(VLOOKUP($A121,[1]Tabelle2!$A:$I,B$2,FALSE),\"\"))","v":"Landtgft. Gratenfels "},{"$f":"IF(OR(B121=\"\",B121=\"-\"),\"\",IFERROR(VLOOKUP($A121,[1]Tabelle2!$A:$I,C$2,FALSE),\"\"))","v":"Landgraf Alrik Custodias-Greifax"},{"$f":"IF(OR(C121=\"\",C121=\"-\"),\"\",IFERROR(VLOOKUP($A121,[1]Tabelle2!$A:$I,D$2,FALSE),\"\"))","v":104650},{"$f":"IF(OR(D121=\"\",D121=\"-\"),\"\",IFERROR(VLOOKUP($A121,[1]Tabelle2!$A:$I,E$2,FALSE),\"\"))","v":1660},106310,1.5614711692220864E-2]
["Nor-III-01P",{"$f":"IF(OR(A122=\"\",A122=\"-\"),\"\",IFERROR(VLOOKUP($A122,[1]Tabelle2!$A:$I,B$2,FALSE),\"\"))","v":"Herzöglich Arraned "},{"$f":"IF(OR(B122=\"\",B122=\"-\"),\"\",IFERROR(VLOOKUP($A122,[1]Tabelle2!$A:$I,C$2,FALSE),\"\"))","v":"Baron Hagrobald Guntwin vom Großen Fluss, vertreten durch Vogt Sieggold Praiomund vom Berg j.H. "},{"$f":"IF(OR(C122=\"\",C122=\"-\"),\"\",IFERROR(VLOOKUP($A122,[1]Tabelle2!$A:$I,D$2,FALSE),\"\"))","v":1700},{"$f":"IF(OR(D122=\"\",D122=\"-\"),\"\",IFERROR(VLOOKUP($A122,[1]Tabelle2!$A:$I,E$2,FALSE),\"\"))","v":100},1800,5.5555555555555552E-2]
["-",{"$f":"IF(OR(A123=\"\",A123=\"-\"),\"\",IFERROR(VLOOKUP($A123,[1]Tabelle2!$A:$I,B$2,FALSE),\"\"))","v":""},{"$f":"IF(OR(B123=\"\",B123=\"-\"),\"\",IFERROR(VLOOKUP($A123,[1]Tabelle2!$A:$I,C$2,FALSE),\"\"))","v":""},{"$f":"IF(OR(C123=\"\",C123=\"-\"),\"\",IFERROR(VLOOKUP($A123,[1]Tabelle2!$A:$I,D$2,FALSE),\"\"))","v":""},{"$f":"IF(OR(D123=\"\",D123=\"-\"),\"\",IFERROR(VLOOKUP($A123,[1]Tabelle2!$A:$I,E$2,FALSE),\"\"))","v":""},"",""]
["Nor-III-01-E01 ",{"$f":"IF(OR(A124=\"\",A124=\"-\"),\"\",IFERROR(VLOOKUP($A124,[1]Tabelle2!$A:$I,B$2,FALSE),\"\"))","v":"Burg Drachenfels (Orden des Heiligen Sturms Rondras)"},{"$f":"IF(OR(B124=\"\",B124=\"-\"),\"\",IFERROR(VLOOKUP($A124,[1]Tabelle2!$A:$I,C$2,FALSE),\"\"))","v":"Ordensmarschallin Caya Sturmfels "},{"$f":"IF(OR(C124=\"\",C124=\"-\"),\"\",IFERROR(VLOOKUP($A124,[1]Tabelle2!$A:$I,D$2,FALSE),\"\"))","v":0},{"$f":"IF(OR(D124=\"\",D124=\"-\"),\"\",IFERROR(VLOOKUP($A124,[1]Tabelle2!$A:$I,E$2,FALSE),\"\"))","v":0},0,""]
["Nor-III-01-E02 ",{"$f":"IF(OR(A125=\"\",A125=\"-\"),\"\",IFERROR(VLOOKUP($A125,[1]Tabelle2!$A:$I,B$2,FALSE),\"\"))","v":"Gut Eberweiler"},{"$f":"IF(OR(B125=\"\",B125=\"-\"),\"\",IFERROR(VLOOKUP($A125,[1]Tabelle2!$A:$I,C$2,FALSE),\"\"))","v":"Edle Lioba von Schleiffenröchte"},{"$f":"IF(OR(C125=\"\",C125=\"-\"),\"\",IFERROR(VLOOKUP($A125,[1]Tabelle2!$A:$I,D$2,FALSE),\"\"))","v":150},{"$f":"IF(OR(D125=\"\",D125=\"-\"),\"\",IFERROR(VLOOKUP($A125,[1]Tabelle2!$A:$I,E$2,FALSE),\"\"))","v":0},150,0]
["Nor-III-02 ",{"$f":"IF(OR(A126=\"\",A126=\"-\"),\"\",IFERROR(VLOOKUP($A126,[1]Tabelle2!$A:$I,B$2,FALSE),\"\"))","v":"Baronie Nablafurt "},{"$f":"IF(OR(B126=\"\",B126=\"-\"),\"\",IFERROR(VLOOKUP($A126,[1]Tabelle2!$A:$I,C$2,FALSE),\"\"))","v":"Baronin Odelinde von der Graufurt "},{"$f":"IF(OR(C126=\"\",C126=\"-\"),\"\",IFERROR(VLOOKUP($A126,[1]Tabelle2!$A:$I,D$2,FALSE),\"\"))","v":1700},{"$f":"IF(OR(D126=\"\",D126=\"-\"),\"\",IFERROR(VLOOKUP($A126,[1]Tabelle2!$A:$I,E$2,FALSE),\"\"))","v":0},1700,0]
["-",{"$f":"IF(OR(A127=\"\",A127=\"-\"),\"\",IFERROR(VLOOKUP($A127,[1]Tabelle2!$A:$I,B$2,FALSE),\"\"))","v":""},{"$f":"IF(OR(B127=\"\",B127=\"-\"),\"\",IFERROR(VLOOKUP($A127,[1]Tabelle2!$A:$I,C$2,FALSE),\"\"))","v":""},{"$f":"IF(OR(C127=\"\",C127=\"-\"),\"\",IFERROR(VLOOKUP($A127,[1]Tabelle2!$A:$I,D$2,FALSE),\"\"))","v":""},{"$f":"IF(OR(D127=\"\",D127=\"-\"),\"\",IFERROR(VLOOKUP($A127,[1]Tabelle2!$A:$I,E$2,FALSE),\"\"))","v":""},"",""]
["Nor-III-02-E1",{"$f":"IF(OR(A128=\"\",A128=\"-\"),\"\",IFERROR(VLOOKUP($A128,[1]Tabelle2!$A:$I,B$2,FALSE),\"\"))","v":"Gut Wildenberg "},{"$f":"IF(OR(B128=\"\",B128=\"-\"),\"\",IFERROR(VLOOKUP($A128,[1]Tabelle2!$A:$I,C$2,FALSE),\"\"))","v":"Edler Finmar Neidenstein von Wildenberg "},{"$f":"IF(OR(C128=\"\",C128=\"-\"),\"\",IFERROR(VLOOKUP($A128,[1]Tabelle2!$A:$I,D$2,FALSE),\"\"))","v":" "},{"$f":"IF(OR(D128=\"\",D128=\"-\"),\"\",IFERROR(VLOOKUP($A128,[1]Tabelle2!$A:$I,E$2,FALSE),\"\"))","v":0},"",""]
["Nor-III-02-E2",{"$f":"IF(OR(A129=\"\",A129=\"-\"),\"\",IFERROR(VLOOKUP($A129,[1]Tabelle2!$A:$I,B$2,FALSE),\"\"))","v":"Edlengut Graufurt"},{"$f":"IF(OR(B129=\"\",B129=\"-\"),\"\",IFERROR(VLOOKUP($A129,[1]Tabelle2!$A:$I,C$2,FALSE),\"\"))","v":"Junkerin Leuina Praiagund von Bilgraten zur Graufurt"},{"$f":"IF(OR(C129=\"\",C129=\"-\"),\"\",IFERROR(VLOOKUP($A129,[1]Tabelle2!$A:$I,D$2,FALSE),\"\"))","v":250},{"$f":"IF(OR(D129=\"\",D129=\"-\"),\"\",IFERROR(VLOOKUP($A129,[1]Tabelle2!$A:$I,E$2,FALSE),\"\"))","v":0},250,0]
["Nor-III-02-E3",{"$f":"IF(OR(A130=\"\",A130=\"-\"),\"\",IFERROR(VLOOKUP($A130,[1]Tabelle2!$A:$I,B$2,FALSE),\"\"))","v":"Gut Eichenau"},{"$f":"IF(OR(B130=\"\",B130=\"-\"),\"\",IFERROR(VLOOKUP($A130,[1]Tabelle2!$A:$I,C$2,FALSE),\"\"))","v":"Dorcas Neidenstein von Eichenau"},{"$f":"IF(OR(C130=\"\",C130=\"-\"),\"\",IFERROR(VLOOKUP($A130,[1]Tabelle2!$A:$I,D$2,FALSE),\"\"))","v":250},{"$f":"IF(OR(D130=\"\",D130=\"-\"),\"\",IFERROR(VLOOKUP($A130,[1]Tabelle2!$A:$I,E$2,FALSE),\"\"))","v":0},250,0]
["Nor-III-03 ",{"$f":"IF(OR(A131=\"\",A131=\"-\"),\"\",IFERROR(VLOOKUP($A131,[1]Tabelle2!$A:$I,B$2,FALSE),\"\"))","v":"Baronie Schnakensee "},{"$f":"IF(OR(B131=\"\",B131=\"-\"),\"\",IFERROR(VLOOKUP($A131,[1]Tabelle2!$A:$I,C$2,FALSE),\"\"))","v":"Baronin Adula von Schnakensee "},{"$f":"IF(OR(C131=\"\",C131=\"-\"),\"\",IFERROR(VLOOKUP($A131,[1]Tabelle2!$A:$I,D$2,FALSE),\"\"))","v":1400},{"$f":"IF(OR(D131=\"\",D131=\"-\"),\"\",IFERROR(VLOOKUP($A131,[1]Tabelle2!$A:$I,E$2,FALSE),\"\"))","v":50},1450,3.4482758620689655E-2]
["Nor-III-03-E1",{"$f":"IF(OR(A132=\"\",A132=\"-\"),\"\",IFERROR(VLOOKUP($A132,[1]Tabelle2!$A:$I,B$2,FALSE),\"\"))","v":"Edlengut Weidenthal"},{"$f":"IF(OR(B132=\"\",B132=\"-\"),\"\",IFERROR(VLOOKUP($A132,[1]Tabelle2!$A:$I,C$2,FALSE),\"\"))","v":"Edle Eilada von Weidenthal"},{"$f":"IF(OR(C132=\"\",C132=\"-\"),\"\",IFERROR(VLOOKUP($A132,[1]Tabelle2!$A:$I,D$2,FALSE),\"\"))","v":250},{"$f":"IF(OR(D132=\"\",D132=\"-\"),\"\",IFERROR(VLOOKUP($A132,[1]Tabelle2!$A:$I,E$2,FALSE),\"\"))","v":0},{"$f":"IFERROR(D132+E132,\"\")","v":250},0]
["Nor-III-03-J1",{"$f":"IF(OR(A133=\"\",A133=\"-\"),\"\",IFERROR(VLOOKUP($A133,[1]Tabelle2!$A:$I,B$2,FALSE),\"\"))","v":"Junkergut Richtwald"},{"$f":"IF(OR(B133=\"\",B133=\"-\"),\"\",IFERROR(VLOOKUP($A133,[1]Tabelle2!$A:$I,C$2,FALSE),\"\"))","v":"Junker Basin von Richtwald, vertreten durch Rittfrau Zadrada von Richtwald"},{"$f":"IF(OR(C133=\"\",C133=\"-\"),\"\",IFERROR(VLOOKUP($A133,[1]Tabelle2!$A:$I,D$2,FALSE),\"\"))","v":350},{"$f":"IF(OR(D133=\"\",D133=\"-\"),\"\",IFERROR(VLOOKUP($A133,[1]Tabelle2!$A:$I,E$2,FALSE),\"\"))","v":0},350,{"$f":"IFERROR(E133/F133,\"\")","v":0}]
["Nor-III-04 ",{"$f":"IF(OR(A134=\"\",A134=\"-\"),\"\",IFERROR(VLOOKUP($A134,[1]Tabelle2!$A:$I,B$2,FALSE),\"\"))","v":"Baronie Ambelmund "},{"$f":"IF(OR(B134=\"\",B134=\"-\"),\"\",IFERROR(VLOOKUP($A134,[1]Tabelle2!$A:$I,C$2,FALSE),\"\"))","v":"Baronin Wunnemine von Fadersberg zu Ambelmund "},{"$f":"IF(OR(C134=\"\",C134=\"-\"),\"\",IFERROR(VLOOKUP($A134,[1]Tabelle2!$A:$I,D$2,FALSE),\"\"))","v":1700},{"$f":"IF(OR(D134=\"\",D134=\"-\"),\"\",IFERROR(VLOOKUP($A134,[1]Tabelle2!$A:$I,E$2,FALSE),\"\"))","v":0},1700,0]
["-",{"$f":"IF(OR(A135=\"\",A135=\"-\"),\"\",IFERROR(VLOOKUP($A135,[1]Tabelle2!$A:$I,B$2,FALSE),\"\"))","v":""},{"$f":"IF(OR(B135=\"\",B135=\"-\"),\"\",IFERROR(VLOOKUP($A135,[1]Tabelle2!$A:$I,C$2,FALSE),\"\"))","v":""},{"$f":"IF(OR(C135=\"\",C135=\"-\"),\"\",IFERROR(VLOOKUP($A135,[1]Tabelle2!$A:$I,D$2,FALSE),\"\"))","v":""},{"$f":"IF(OR(D135=\"\",D135=\"-\"),\"\",IFERROR(VLOOKUP($A135,[1]Tabelle2!$A:$I,E$2,FALSE),\"\"))","v":""},"",""]
["Nor-III-04-E1",{"$f":"IF(OR(A136=\"\",A136=\"-\"),\"\",IFERROR(VLOOKUP($A136,[1]Tabelle2!$A:$I,B$2,FALSE),\"\"))","v":"Gut Fadersberg"},{"$f":"IF(OR(B136=\"\",B136=\"-\"),\"\",IFERROR(VLOOKUP($A136,[1]Tabelle2!$A:$I,C$2,FALSE),\"\"))","v":"Baronin Wunnemine von Fadersberg zu Ambelmund "},{"$f":"IF(OR(C136=\"\",C136=\"-\"),\"\",IFERROR(VLOOKUP($A136,[1]Tabelle2!$A:$I,D$2,FALSE),\"\"))","v":420},{"$f":"IF(OR(D136=\"\",D136=\"-\"),\"\",IFERROR(VLOOKUP($A136,[1]Tabelle2!$A:$I,E$2,FALSE),\"\"))","v":0},420,0]
["Nor-III-04-E2",{"$f":"IF(OR(A137=\"\",A137=\"-\"),\"\",IFERROR(VLOOKUP($A137,[1]Tabelle2!$A:$I,B$2,FALSE),\"\"))","v":"Gut Tannenfels"},{"$f":"IF(OR(B137=\"\",B137=\"-\"),\"\",IFERROR(VLOOKUP($A137,[1]Tabelle2!$A:$I,C$2,FALSE),\"\"))","v":"Celissa von Tannenfels"},{"$f":"IF(OR(C137=\"\",C137=\"-\"),\"\",IFERROR(VLOOKUP($A137,[1]Tabelle2!$A:$I,D$2,FALSE),\"\"))","v":130},{"$f":"IF(OR(D137=\"\",D137=\"-\"),\"\",IFERROR(VLOOKUP($A137,[1]Tabelle2!$A:$I,E$2,FALSE),\"\"))","v":0},130,0]
["Nor-III-04-E3",{"$f":"IF(OR(A138=\"\",A138=\"-\"),\"\",IFERROR(VLOOKUP($A138,[1]Tabelle2!$A:$I,B$2,FALSE),\"\"))","v":"Gut Schwarzentann"},{"$f":"IF(OR(B138=\"\",B138=\"-\"),\"\",IFERROR(VLOOKUP($A138,[1]Tabelle2!$A:$I,C$2,FALSE),\"\"))","v":"xxx vom schwarzen Tann"},{"$f":"IF(OR(C138=\"\",C138=\"-\"),\"\",IFERROR(VLOOKUP($A138,[1]Tabelle2!$A:$I,D$2,FALSE),\"\"))","v":140},{"$f":"IF(OR(D138=\"\",D138=\"-\"),\"\",IFERROR(VLOOKUP($A138,[1]Tabelle2!$A:$I,E$2,FALSE),\"\"))","v":0},140,0]
["Nor-III-04-E4",{"$f":"IF(OR(A139=\"\",A139=\"-\"),\"\",IFERROR(VLOOKUP($A139,[1]Tabelle2!$A:$I,B$2,FALSE),\"\"))","v":"Rittergut Tommeltann"},{"$f":"IF(OR(B139=\"\",B139=\"-\"),\"\",IFERROR(VLOOKUP($A139,[1]Tabelle2!$A:$I,C$2,FALSE),\"\"))","v":"xxx von Tommeltann"},{"$f":"IF(OR(C139=\"\",C139=\"-\"),\"\",IFERROR(VLOOKUP($A139,[1]Tabelle2!$A:$I,D$2,FALSE),\"\"))","v":130},{"$f":"IF(OR(D139=\"\",D139=\"-\"),\"\",IFERROR(VLOOKUP($A139,[1]Tabelle2!$A:$I,E$2,FALSE),\"\"))","v":0},130,0]
["Nor-III-04-J1",{"$f":"IF(OR(A140=\"\",A140=\"-\"),\"\",IFERROR(VLOOKUP($A140,[1]Tabelle2!$A:$I,B$2,FALSE),\"\"))","v":"Junkergut Lifstein"},{"$f":"IF(OR(B140=\"\",B140=\"-\"),\"\",IFERROR(VLOOKUP($A140,[1]Tabelle2!$A:$I,C$2,FALSE),\"\"))","v":"Radulf von Lifstein"},{"$f":"IF(OR(C140=\"\",C140=\"-\"),\"\",IFERROR(VLOOKUP($A140,[1]Tabelle2!$A:$I,D$2,FALSE),\"\"))","v":300},{"$f":"IF(OR(D140=\"\",D140=\"-\"),\"\",IFERROR(VLOOKUP($A140,[1]Tabelle2!$A:$I,E$2,FALSE),\"\"))","v":0},300,0]
["Nor-III-05 ",{"$f":"IF(OR(A141=\"\",A141=\"-\"),\"\",IFERROR(VLOOKUP($A141,[1]Tabelle2!$A:$I,B$2,FALSE),\"\"))","v":"Baronie Tommelsbeuge "},{"$f":"IF(OR(B141=\"\",B141=\"-\"),\"\",IFERROR(VLOOKUP($A141,[1]Tabelle2!$A:$I,C$2,FALSE),\"\"))","v":"Baron Geribold v. Fischwachttal"},{"$f":"IF(OR(C141=\"\",C141=\"-\"),\"\",IFERROR(VLOOKUP($A141,[1]Tabelle2!$A:$I,D$2,FALSE),\"\"))","v":2000},{"$f":"IF(OR(D141=\"\",D141=\"-\"),\"\",IFERROR(VLOOKUP($A141,[1]Tabelle2!$A:$I,E$2,FALSE),\"\"))","v":0},2000,0]
["Nor-III-05-E1",{"$f":"IF(OR(A142=\"\",A142=\"-\"),\"\",IFERROR(VLOOKUP($A142,[1]Tabelle2!$A:$I,B$2,FALSE),\"\"))","v":"Gut Bösalbentrutz"},{"$f":"IF(OR(B142=\"\",B142=\"-\"),\"\",IFERROR(VLOOKUP($A142,[1]Tabelle2!$A:$I,C$2,FALSE),\"\"))","v":"Roana von Fischwachttal"},{"$f":"IF(OR(C142=\"\",C142=\"-\"),\"\",IFERROR(VLOOKUP($A142,[1]Tabelle2!$A:$I,D$2,FALSE),\"\"))","v":110},{"$f":"IF(OR(D142=\"\",D142=\"-\"),\"\",IFERROR(VLOOKUP($A142,[1]Tabelle2!$A:$I,E$2,FALSE),\"\"))","v":0},110,0]
["Nor-III-05-E2",{"$f":"IF(OR(A143=\"\",A143=\"-\"),\"\",IFERROR(VLOOKUP($A143,[1]Tabelle2!$A:$I,B$2,FALSE),\"\"))","v":"Gut Treuklingen"},{"$f":"IF(OR(B143=\"\",B143=\"-\"),\"\",IFERROR(VLOOKUP($A143,[1]Tabelle2!$A:$I,C$2,FALSE),\"\"))","v":"Vögtin Frederun Lechmin von Weitenfeld"},{"$f":"IF(OR(C143=\"\",C143=\"-\"),\"\",IFERROR(VLOOKUP($A143,[1]Tabelle2!$A:$I,D$2,FALSE),\"\"))","v":280},{"$f":"IF(OR(D143=\"\",D143=\"-\"),\"\",IFERROR(VLOOKUP($A143,[1]Tabelle2!$A:$I,E$2,FALSE),\"\"))","v":0},280,0]
["Nor-III-05-E3",{"$f":"IF(OR(A144=\"\",A144=\"-\"),\"\",IFERROR(VLOOKUP($A144,[1]Tabelle2!$A:$I,B$2,FALSE),\"\"))","v":"Gut Tommelsfurt"},{"$f":"IF(OR(B144=\"\",B144=\"-\"),\"\",IFERROR(VLOOKUP($A144,[1]Tabelle2!$A:$I,C$2,FALSE),\"\"))","v":"Madalin von Lerchentrutz"},{"$f":"IF(OR(C144=\"\",C144=\"-\"),\"\",IFERROR(VLOOKUP($A144,[1]Tabelle2!$A:$I,D$2,FALSE),\"\"))","v":0},{"$f":"IF(OR(D144=\"\",D144=\"-\"),\"\",IFERROR(VLOOKUP($A144,[1]Tabelle2!$A:$I,E$2,FALSE),\"\"))","v":0},0,""]
["Nor-III-05-E4",{"$f":"IF(OR(A145=\"\",A145=\"-\"),\"\",IFERROR(VLOOKUP($A145,[1]Tabelle2!$A:$I,B$2,FALSE),\"\"))","v":"Rittergut Auroth"},{"$f":"IF(OR(B145=\"\",B145=\"-\"),\"\",IFERROR(VLOOKUP($A145,[1]Tabelle2!$A:$I,C$2,FALSE),\"\"))","v":"Rittfrau Lûthara von Au-Ibenburg"},{"$f":"IF(OR(C145=\"\",C145=\"-\"),\"\",IFERROR(VLOOKUP($A145,[1]Tabelle2!$A:$I,D$2,FALSE),\"\"))","v":0},{"$f":"IF(OR(D145=\"\",D145=\"-\"),\"\",IFERROR(VLOOKUP($A145,[1]Tabelle2!$A:$I,E$2,FALSE),\"\"))","v":0},0,""]
["Nor-III-05-E5",{"$f":"IF(OR(A146=\"\",A146=\"-\"),\"\",IFERROR(VLOOKUP($A146,[1]Tabelle2!$A:$I,B$2,FALSE),\"\"))","v":"Gut Brinborn"},{"$f":"IF(OR(B146=\"\",B146=\"-\"),\"\",IFERROR(VLOOKUP($A146,[1]Tabelle2!$A:$I,C$2,FALSE),\"\"))","v":"Orden des heiligen Zorns"},{"$f":"IF(OR(C146=\"\",C146=\"-\"),\"\",IFERROR(VLOOKUP($A146,[1]Tabelle2!$A:$I,D$2,FALSE),\"\"))","v":80},{"$f":"IF(OR(D146=\"\",D146=\"-\"),\"\",IFERROR(VLOOKUP($A146,[1]Tabelle2!$A:$I,E$2,FALSE),\"\"))","v":0},80,0]
["Nor-III-05-J1",{"$f":"IF(OR(A147=\"\",A147=\"-\"),\"\",IFERROR(VLOOKUP($A147,[1]Tabelle2!$A:$I,B$2,FALSE),\"\"))","v":"Gräflich Bösalbentrutz"},{"$f":"IF(OR(B147=\"\",B147=\"-\"),\"\",IFERROR(VLOOKUP($A147,[1]Tabelle2!$A:$I,C$2,FALSE),\"\"))","v":"Vögtin Irminella Ermine von Ibenburg-Eberbach"},{"$f":"IF(OR(C147=\"\",C147=\"-\"),\"\",IFERROR(VLOOKUP($A147,[1]Tabelle2!$A:$I,D$2,FALSE),\"\"))","v":0},{"$f":"IF(OR(D147=\"\",D147=\"-\"),\"\",IFERROR(VLOOKUP($A147,[1]Tabelle2!$A:$I,E$2,FALSE),\"\"))","v":0},0,""]
["Nor-III-06 ",{"$f":"IF(OR(A148=\"\",A148=\"-\"),\"\",IFERROR(VLOOKUP($A148,[1]Tabelle2!$A:$I,B$2,FALSE),\"\"))","v":"Baronie Vairningen "},{"$f":"IF(OR(B148=\"\",B148=\"-\"),\"\",IFERROR(VLOOKUP($A148,[1]Tabelle2!$A:$I,C$2,FALSE),\"\"))","v":"Baronin Vea Timerlain von Vairningen"},{"$f":"IF(OR(C148=\"\",C148=\"-\"),\"\",IFERROR(VLOOKUP($A148,[1]Tabelle2!$A:$I,D$2,FALSE),\"\"))","v":3830},{"$f":"IF(OR(D148=\"\",D148=\"-\"),\"\",IFERROR(VLOOKUP($A148,[1]Tabelle2!$A:$I,E$2,FALSE),\"\"))","v":90},3920,2.2959183673469389E-2]
["-",{"$f":"IF(OR(A149=\"\",A149=\"-\"),\"\",IFERROR(VLOOKUP($A149,[1]Tabelle2!$A:$I,B$2,FALSE),\"\"))","v":""},{"$f":"IF(OR(B149=\"\",B149=\"-\"),\"\",IFERROR(VLOOKUP($A149,[1]Tabelle2!$A:$I,C$2,FALSE),\"\"))","v":""},{"$f":"IF(OR(C149=\"\",C149=\"-\"),\"\",IFERROR(VLOOKUP($A149,[1]Tabelle2!$A:$I,D$2,FALSE),\"\"))","v":""},{"$f":"IF(OR(D149=\"\",D149=\"-\"),\"\",IFERROR(VLOOKUP($A149,[1]Tabelle2!$A:$I,E$2,FALSE),\"\"))","v":""},"",""]
["Nor-III-06-E1",{"$f":"IF(OR(A150=\"\",A150=\"-\"),\"\",IFERROR(VLOOKUP($A150,[1]Tabelle2!$A:$I,B$2,FALSE),\"\"))","v":"Domäne Vairntal"},{"$f":"IF(OR(B150=\"\",B150=\"-\"),\"\",IFERROR(VLOOKUP($A150,[1]Tabelle2!$A:$I,C$2,FALSE),\"\"))","v":"Domänengut des Barons"},{"$f":"IF(OR(C150=\"\",C150=\"-\"),\"\",IFERROR(VLOOKUP($A150,[1]Tabelle2!$A:$I,D$2,FALSE),\"\"))","v":600},{"$f":"IF(OR(D150=\"\",D150=\"-\"),\"\",IFERROR(VLOOKUP($A150,[1]Tabelle2!$A:$I,E$2,FALSE),\"\"))","v":50},650,7.6923076923076927E-2]
["Nor-III-06-E2",{"$f":"IF(OR(A151=\"\",A151=\"-\"),\"\",IFERROR(VLOOKUP($A151,[1]Tabelle2!$A:$I,B$2,FALSE),\"\"))","v":"Rittergut Gellerstock"},{"$f":"IF(OR(B151=\"\",B151=\"-\"),\"\",IFERROR(VLOOKUP($A151,[1]Tabelle2!$A:$I,C$2,FALSE),\"\"))","v":"vakant"},{"$f":"IF(OR(C151=\"\",C151=\"-\"),\"\",IFERROR(VLOOKUP($A151,[1]Tabelle2!$A:$I,D$2,FALSE),\"\"))","v":120},{"$f":"IF(OR(D151=\"\",D151=\"-\"),\"\",IFERROR(VLOOKUP($A151,[1]Tabelle2!$A:$I,E$2,FALSE),\"\"))","v":0},120,0]
["Nor-III-06-E3",{"$f":"IF(OR(A152=\"\",A152=\"-\"),\"\",IFERROR(VLOOKUP($A152,[1]Tabelle2!$A:$I,B$2,FALSE),\"\"))","v":"Burg Rauestahl"},{"$f":"IF(OR(B152=\"\",B152=\"-\"),\"\",IFERROR(VLOOKUP($A152,[1]Tabelle2!$A:$I,C$2,FALSE),\"\"))","v":"Raubritter Gundewald von Rauestahl"},{"$f":"IF(OR(C152=\"\",C152=\"-\"),\"\",IFERROR(VLOOKUP($A152,[1]Tabelle2!$A:$I,D$2,FALSE),\"\"))","v":50},{"$f":"IF(OR(D152=\"\",D152=\"-\"),\"\",IFERROR(VLOOKUP($A152,[1]Tabelle2!$A:$I,E$2,FALSE),\"\"))","v":0},50,0]
["Nor-III-06-E4",{"$f":"IF(OR(A153=\"\",A153=\"-\"),\"\",IFERROR(VLOOKUP($A153,[1]Tabelle2!$A:$I,B$2,FALSE),\"\"))","v":"Rittergut Weihern"},{"$f":"IF(OR(B153=\"\",B153=\"-\"),\"\",IFERROR(VLOOKUP($A153,[1]Tabelle2!$A:$I,C$2,FALSE),\"\"))","v":"Ritter Adelrat Thomundson"},{"$f":"IF(OR(C153=\"\",C153=\"-\"),\"\",IFERROR(VLOOKUP($A153,[1]Tabelle2!$A:$I,D$2,FALSE),\"\"))","v":150},{"$f":"IF(OR(D153=\"\",D153=\"-\"),\"\",IFERROR(VLOOKUP($A153,[1]Tabelle2!$A:$I,E$2,FALSE),\"\"))","v":0},150,0]
["Nor-III-06-E5",{"$f":"IF(OR(A154=\"\",A154=\"-\"),\"\",IFERROR(VLOOKUP($A154,[1]Tabelle2!$A:$I,B$2,FALSE),\"\"))","v":"Edlengut Effertingen"},{"$f":"IF(OR(B154=\"\",B154=\"-\"),\"\",IFERROR(VLOOKUP($A154,[1]Tabelle2!$A:$I,C$2,FALSE),\"\"))","v":"Baron Basin von Richtwald, vertreten durch Ritter Runegard vom Schwarzen Quell"},{"$f":"IF(OR(C154=\"\",C154=\"-\"),\"\",IFERROR(VLOOKUP($A154,[1]Tabelle2!$A:$I,D$2,FALSE),\"\"))","v":450},{"$f":"IF(OR(D154=\"\",D154=\"-\"),\"\",IFERROR(VLOOKUP($A154,[1]Tabelle2!$A:$I,E$2,FALSE),\"\"))","v":0},450,0]
["Nor-III-06-E6",{"$f":"IF(OR(A155=\"\",A155=\"-\"),\"\",IFERROR(VLOOKUP($A155,[1]Tabelle2!$A:$I,B$2,FALSE),\"\"))","v":"Rittergut Waldenberg"},{"$f":"IF(OR(B155=\"\",B155=\"-\"),\"\",IFERROR(VLOOKUP($A155,[1]Tabelle2!$A:$I,C$2,FALSE),\"\"))","v":"Rittfrau Riochhild von Fuchsberg"},{"$f":"IF(OR(C155=\"\",C155=\"-\"),\"\",IFERROR(VLOOKUP($A155,[1]Tabelle2!$A:$I,D$2,FALSE),\"\"))","v":120},{"$f":"IF(OR(D155=\"\",D155=\"-\"),\"\",IFERROR(VLOOKUP($A155,[1]Tabelle2!$A:$I,E$2,FALSE),\"\"))","v":0},120,0]
["Nor-III-06-E7",{"$f":"IF(OR(A156=\"\",A156=\"-\"),\"\",IFERROR(VLOOKUP($A156,[1]Tabelle2!$A:$I,B$2,FALSE),\"\"))","v":"Edlengut Minningen"},{"$f":"IF(OR(B156=\"\",B156=\"-\"),\"\",IFERROR(VLOOKUP($A156,[1]Tabelle2!$A:$I,C$2,FALSE),\"\"))","v":"Sortosch, Sohn des Aborax"},{"$f":"IF(OR(C156=\"\",C156=\"-\"),\"\",IFERROR(VLOOKUP($A156,[1]Tabelle2!$A:$I,D$2,FALSE),\"\"))","v":150},{"$f":"IF(OR(D156=\"\",D156=\"-\"),\"\",IFERROR(VLOOKUP($A156,[1]Tabelle2!$A:$I,E$2,FALSE),\"\"))","v":50},200,0.25]
["Nor-III-06-E8",{"$f":"IF(OR(A157=\"\",A157=\"-\"),\"\",IFERROR(VLOOKUP($A157,[1]Tabelle2!$A:$I,B$2,FALSE),\"\"))","v":"Edlengut Saibeltal"},{"$f":"IF(OR(B157=\"\",B157=\"-\"),\"\",IFERROR(VLOOKUP($A157,[1]Tabelle2!$A:$I,C$2,FALSE),\"\"))","v":"Durinja von Saibeltal"},{"$f":"IF(OR(C157=\"\",C157=\"-\"),\"\",IFERROR(VLOOKUP($A157,[1]Tabelle2!$A:$I,D$2,FALSE),\"\"))","v":200},{"$f":"IF(OR(D157=\"\",D157=\"-\"),\"\",IFERROR(VLOOKUP($A157,[1]Tabelle2!$A:$I,E$2,FALSE),\"\"))","v":0},200,0]
["Nor-III-06-E9",{"$f":"IF(OR(A158=\"\",A158=\"-\"),\"\",IFERROR(VLOOKUP($A158,[1]Tabelle2!$A:$I,B$2,FALSE),\"\"))","v":"Rittergut Girswald"},{"$f":"IF(OR(B158=\"\",B158=\"-\"),\"\",IFERROR(VLOOKUP($A158,[1]Tabelle2!$A:$I,C$2,FALSE),\"\"))","v":"vakant"},{"$f":"IF(OR(C158=\"\",C158=\"-\"),\"\",IFERROR(VLOOKUP($A158,[1]Tabelle2!$A:$I,D$2,FALSE),\"\"))","v":150},{"$f":"IF(OR(D158=\"\",D158=\"-\"),\"\",IFERROR(VLOOKUP($A158,[1]Tabelle2!$A:$I,E$2,FALSE),\"\"))","v":0},150,0]
["Nor-III-06-E10",{"$f":"IF(OR(A159=\"\",A159=\"-\"),\"\",IFERROR(VLOOKUP($A159,[1]Tabelle2!$A:$I,B$2,FALSE),\"\"))","v":"Edlengut Kranickau"},{"$f":"IF(OR(B159=\"\",B159=\"-\"),\"\",IFERROR(VLOOKUP($A159,[1]Tabelle2!$A:$I,C$2,FALSE),\"\"))","v":"Barnabas von Kranickau"},{"$f":"IF(OR(C159=\"\",C159=\"-\"),\"\",IFERROR(VLOOKUP($A159,[1]Tabelle2!$A:$I,D$2,FALSE),\"\"))","v":170},{"$f":"IF(OR(D159=\"\",D159=\"-\"),\"\",IFERROR(VLOOKUP($A159,[1]Tabelle2!$A:$I,E$2,FALSE),\"\"))","v":0},170,0]
["Nor-III-06-E11",{"$f":"IF(OR(A160=\"\",A160=\"-\"),\"\",IFERROR(VLOOKUP($A160,[1]Tabelle2!$A:$I,B$2,FALSE),\"\"))","v":"Rittergut Avesstein"},{"$f":"IF(OR(B160=\"\",B160=\"-\"),\"\",IFERROR(VLOOKUP($A160,[1]Tabelle2!$A:$I,C$2,FALSE),\"\"))","v":"Rittfrau Jocasta von Salmfang"},{"$f":"IF(OR(C160=\"\",C160=\"-\"),\"\",IFERROR(VLOOKUP($A160,[1]Tabelle2!$A:$I,D$2,FALSE),\"\"))","v":150},{"$f":"IF(OR(D160=\"\",D160=\"-\"),\"\",IFERROR(VLOOKUP($A160,[1]Tabelle2!$A:$I,E$2,FALSE),\"\"))","v":10},160,6.25E-2]
["Nor-III-06-E12",{"$f":"IF(OR(A161=\"\",A161=\"-\"),\"\",IFERROR(VLOOKUP($A161,[1]Tabelle2!$A:$I,B$2,FALSE),\"\"))","v":"Rittergut Starkwalden"},{"$f":"IF(OR(B161=\"\",B161=\"-\"),\"\",IFERROR(VLOOKUP($A161,[1]Tabelle2!$A:$I,C$2,FALSE),\"\"))","v":"Ritter Radbot von Starkwalden"},{"$f":"IF(OR(C161=\"\",C161=\"-\"),\"\",IFERROR(VLOOKUP($A161,[1]Tabelle2!$A:$I,D$2,FALSE),\"\"))","v":150},{"$f":"IF(OR(D161=\"\",D161=\"-\"),\"\",IFERROR(VLOOKUP($A161,[1]Tabelle2!$A:$I,E$2,FALSE),\"\"))","v":0},150,0]
["Nor-III-06-E13",{"$f":"IF(OR(A162=\"\",A162=\"-\"),\"\",IFERROR(VLOOKUP($A162,[1]Tabelle2!$A:$I,B$2,FALSE),\"\"))","v":"Rittergut Waidwacht"},{"$f":"IF(OR(B162=\"\",B162=\"-\"),\"\",IFERROR(VLOOKUP($A162,[1]Tabelle2!$A:$I,C$2,FALSE),\"\"))","v":"verwaltet durch Idra Thomundson"},{"$f":"IF(OR(C162=\"\",C162=\"-\"),\"\",IFERROR(VLOOKUP($A162,[1]Tabelle2!$A:$I,D$2,FALSE),\"\"))","v":130},{"$f":"IF(OR(D162=\"\",D162=\"-\"),\"\",IFERROR(VLOOKUP($A162,[1]Tabelle2!$A:$I,E$2,FALSE),\"\"))","v":10},140,7.1428571428571425E-2]
["Nor-III-06-J1",{"$f":"IF(OR(A163=\"\",A163=\"-\"),\"\",IFERROR(VLOOKUP($A163,[1]Tabelle2!$A:$I,B$2,FALSE),\"\"))","v":"Junkergut Neu-Foerttingen"},{"$f":"IF(OR(B163=\"\",B163=\"-\"),\"\",IFERROR(VLOOKUP($A163,[1]Tabelle2!$A:$I,C$2,FALSE),\"\"))","v":"Junker Dragowin Timerlain von Vairningen "},{"$f":"IF(OR(C163=\"\",C163=\"-\"),\"\",IFERROR(VLOOKUP($A163,[1]Tabelle2!$A:$I,D$2,FALSE),\"\"))","v":500},{"$f":"IF(OR(D163=\"\",D163=\"-\"),\"\",IFERROR(VLOOKUP($A163,[1]Tabelle2!$A:$I,E$2,FALSE),\"\"))","v":10},510,1.9607843137254902E-2]
["Nor-III-06-J1-R1",{"$f":"IF(OR(A164=\"\",A164=\"-\"),\"\",IFERROR(VLOOKUP($A164,[1]Tabelle2!$A:$I,B$2,FALSE),\"\"))","v":"Ritterlich Lichterfeld"},{"$f":"IF(OR(B164=\"\",B164=\"-\"),\"\",IFERROR(VLOOKUP($A164,[1]Tabelle2!$A:$I,C$2,FALSE),\"\"))","v":"Ritter Diemut Rondmar vom Schwarzen Quell"},{"$f":"IF(OR(C164=\"\",C164=\"-\"),\"\",IFERROR(VLOOKUP($A164,[1]Tabelle2!$A:$I,D$2,FALSE),\"\"))","v":125},{"$f":"IF(OR(D164=\"\",D164=\"-\"),\"\",IFERROR(VLOOKUP($A164,[1]Tabelle2!$A:$I,E$2,FALSE),\"\"))","v":0},125,0]
["Nor-III-06-J1-R2",{"$f":"IF(OR(A165=\"\",A165=\"-\"),\"\",IFERROR(VLOOKUP($A165,[1]Tabelle2!$A:$I,B$2,FALSE),\"\"))","v":"Ritterlich Eichwalde"},{"$f":"IF(OR(B165=\"\",B165=\"-\"),\"\",IFERROR(VLOOKUP($A165,[1]Tabelle2!$A:$I,C$2,FALSE),\"\"))","v":"Ritter Wikterp von Caldenburg"},{"$f":"IF(OR(C165=\"\",C165=\"-\"),\"\",IFERROR(VLOOKUP($A165,[1]Tabelle2!$A:$I,D$2,FALSE),\"\"))","v":150},{"$f":"IF(OR(D165=\"\",D165=\"-\"),\"\",IFERROR(VLOOKUP($A165,[1]Tabelle2!$A:$I,E$2,FALSE),\"\"))","v":0},150,0]
["Nor-III-07 ",{"$f":"IF(OR(A166=\"\",A166=\"-\"),\"\",IFERROR(VLOOKUP($A166,[1]Tabelle2!$A:$I,B$2,FALSE),\"\"))","v":"Baronie Firnholz "},{"$f":"IF(OR(B166=\"\",B166=\"-\"),\"\",IFERROR(VLOOKUP($A166,[1]Tabelle2!$A:$I,C$2,FALSE),\"\"))","v":"Baronin Fedora Madalin vom Firnholz"},{"$f":"IF(OR(C166=\"\",C166=\"-\"),\"\",IFERROR(VLOOKUP($A166,[1]Tabelle2!$A:$I,D$2,FALSE),\"\"))","v":1400},{"$f":"IF(OR(D166=\"\",D166=\"-\"),\"\",IFERROR(VLOOKUP($A166,[1]Tabelle2!$A:$I,E$2,FALSE),\"\"))","v":200},1600,0.125]
["Nor-III-07-E1",{"$f":"IF(OR(A167=\"\",A167=\"-\"),\"\",IFERROR(VLOOKUP($A167,[1]Tabelle2!$A:$I,B$2,FALSE),\"\"))","v":"Gut Eberswalde"},{"$f":"IF(OR(B167=\"\",B167=\"-\"),\"\",IFERROR(VLOOKUP($A167,[1]Tabelle2!$A:$I,C$2,FALSE),\"\"))","v":"Baronin Fedora von Firnholz, vertreten durch Ritter Belfionn Eichblatt"},{"$f":"IF(OR(C167=\"\",C167=\"-\"),\"\",IFERROR(VLOOKUP($A167,[1]Tabelle2!$A:$I,D$2,FALSE),\"\"))","v":400},{"$f":"IF(OR(D167=\"\",D167=\"-\"),\"\",IFERROR(VLOOKUP($A167,[1]Tabelle2!$A:$I,E$2,FALSE),\"\"))","v":0},400,0]
["Nor-III-07-E2",{"$f":"IF(OR(A168=\"\",A168=\"-\"),\"\",IFERROR(VLOOKUP($A168,[1]Tabelle2!$A:$I,B$2,FALSE),\"\"))","v":"Rittergut Föhrenberg "},{"$f":"IF(OR(B168=\"\",B168=\"-\"),\"\",IFERROR(VLOOKUP($A168,[1]Tabelle2!$A:$I,C$2,FALSE),\"\"))","v":"Baronin Fedora von Firnholz, vertreten durch Ritter Diethard von Zairingen"},{"$f":"IF(OR(C168=\"\",C168=\"-\"),\"\",IFERROR(VLOOKUP($A168,[1]Tabelle2!$A:$I,D$2,FALSE),\"\"))","v":300},{"$f":"IF(OR(D168=\"\",D168=\"-\"),\"\",IFERROR(VLOOKUP($A168,[1]Tabelle2!$A:$I,E$2,FALSE),\"\"))","v":0},300,0]
["Nor-III-07-E3",{"$f":"IF(OR(A169=\"\",A169=\"-\"),\"\",IFERROR(VLOOKUP($A169,[1]Tabelle2!$A:$I,B$2,FALSE),\"\"))","v":"Stadt & Land Gevelsberg"},{"$f":"IF(OR(B169=\"\",B169=\"-\"),\"\",IFERROR(VLOOKUP($A169,[1]Tabelle2!$A:$I,C$2,FALSE),\"\"))","v":"Baronin Fedora Madalin vom Firnholz"},{"$f":"IF(OR(C169=\"\",C169=\"-\"),\"\",IFERROR(VLOOKUP($A169,[1]Tabelle2!$A:$I,D$2,FALSE),\"\"))","v":400},{"$f":"IF(OR(D169=\"\",D169=\"-\"),\"\",IFERROR(VLOOKUP($A169,[1]Tabelle2!$A:$I,E$2,FALSE),\"\"))","v":0},400,0]
["Nor-III-07-J1",{"$f":"IF(OR(A170=\"\",A170=\"-\"),\"\",IFERROR(VLOOKUP($A170,[1]Tabelle2!$A:$I,B$2,FALSE),\"\"))","v":"Gut Reussenstein"},{"$f":"IF(OR(B170=\"\",B170=\"-\"),\"\",IFERROR(VLOOKUP($A170,[1]Tabelle2!$A:$I,C$2,FALSE),\"\"))","v":"Vogt Bardo Aich"},{"$f":"IF(OR(C170=\"\",C170=\"-\"),\"\",IFERROR(VLOOKUP($A170,[1]Tabelle2!$A:$I,D$2,FALSE),\"\"))","v":150},{"$f":"IF(OR(D170=\"\",D170=\"-\"),\"\",IFERROR(VLOOKUP($A170,[1]Tabelle2!$A:$I,E$2,FALSE),\"\"))","v":0},150,0]
["Nor-III-07-J2",{"$f":"IF(OR(A171=\"\",A171=\"-\"),\"\",IFERROR(VLOOKUP($A171,[1]Tabelle2!$A:$I,B$2,FALSE),\"\"))","v":"Gut Rothammer "},{"$f":"IF(OR(B171=\"\",B171=\"-\"),\"\",IFERROR(VLOOKUP($A171,[1]Tabelle2!$A:$I,C$2,FALSE),\"\"))","v":"Vogt Arjuk von Rothammer"},{"$f":"IF(OR(C171=\"\",C171=\"-\"),\"\",IFERROR(VLOOKUP($A171,[1]Tabelle2!$A:$I,D$2,FALSE),\"\"))","v":150},{"$f":"IF(OR(D171=\"\",D171=\"-\"),\"\",IFERROR(VLOOKUP($A171,[1]Tabelle2!$A:$I,E$2,FALSE),\"\"))","v":0},150,0]
["Nor-III-08 ",{"$f":"IF(OR(A172=\"\",A172=\"-\"),\"\",IFERROR(VLOOKUP($A172,[1]Tabelle2!$A:$I,B$2,FALSE),\"\"))","v":"Baronie Urbeltor "},{"$f":"IF(OR(B172=\"\",B172=\"-\"),\"\",IFERROR(VLOOKUP($A172,[1]Tabelle2!$A:$I,C$2,FALSE),\"\"))","v":"Baron Hal Praiodan Tsafelde von Urbeltor/Vogt Koradin von Schellenstein "},{"$f":"IF(OR(C172=\"\",C172=\"-\"),\"\",IFERROR(VLOOKUP($A172,[1]Tabelle2!$A:$I,D$2,FALSE),\"\"))","v":1100},{"$f":"IF(OR(D172=\"\",D172=\"-\"),\"\",IFERROR(VLOOKUP($A172,[1]Tabelle2!$A:$I,E$2,FALSE),\"\"))","v":150},1250,0.12]
["Nor-III-09 ",{"$f":"IF(OR(A173=\"\",A173=\"-\"),\"\",IFERROR(VLOOKUP($A173,[1]Tabelle2!$A:$I,B$2,FALSE),\"\"))","v":"Baronie Kranick "},{"$f":"IF(OR(B173=\"\",B173=\"-\"),\"\",IFERROR(VLOOKUP($A173,[1]Tabelle2!$A:$I,C$2,FALSE),\"\"))","v":"Baronin Iriane Madalin von Kranick zum Kranichfluchs"},{"$f":"IF(OR(C173=\"\",C173=\"-\"),\"\",IFERROR(VLOOKUP($A173,[1]Tabelle2!$A:$I,D$2,FALSE),\"\"))","v":2000},{"$f":"IF(OR(D173=\"\",D173=\"-\"),\"\",IFERROR(VLOOKUP($A173,[1]Tabelle2!$A:$I,E$2,FALSE),\"\"))","v":50},2050,2.4390243902439025E-2]
["Nor-III-09-E1",{"$f":"IF(OR(A174=\"\",A174=\"-\"),\"\",IFERROR(VLOOKUP($A174,[1]Tabelle2!$A:$I,B$2,FALSE),\"\"))","v":"Rittergut Kranickteich"},{"$f":"IF(OR(B174=\"\",B174=\"-\"),\"\",IFERROR(VLOOKUP($A174,[1]Tabelle2!$A:$I,C$2,FALSE),\"\"))","v":"Ritter Fulco von Kranickteich"},{"$f":"IF(OR(C174=\"\",C174=\"-\"),\"\",IFERROR(VLOOKUP($A174,[1]Tabelle2!$A:$I,D$2,FALSE),\"\"))","v":220},{"$f":"IF(OR(D174=\"\",D174=\"-\"),\"\",IFERROR(VLOOKUP($A174,[1]Tabelle2!$A:$I,E$2,FALSE),\"\"))","v":0},220,0]
["Nor-III-09-E2",{"$f":"IF(OR(A175=\"\",A175=\"-\"),\"\",IFERROR(VLOOKUP($A175,[1]Tabelle2!$A:$I,B$2,FALSE),\"\"))","v":"Rittergut Aelgarsfels"},{"$f":"IF(OR(B175=\"\",B175=\"-\"),\"\",IFERROR(VLOOKUP($A175,[1]Tabelle2!$A:$I,C$2,FALSE),\"\"))","v":"Ritter Darion von Aelgarsfels"},{"$f":"IF(OR(C175=\"\",C175=\"-\"),\"\",IFERROR(VLOOKUP($A175,[1]Tabelle2!$A:$I,D$2,FALSE),\"\"))","v":200},{"$f":"IF(OR(D175=\"\",D175=\"-\"),\"\",IFERROR(VLOOKUP($A175,[1]Tabelle2!$A:$I,E$2,FALSE),\"\"))","v":0},200,0]
["Nor-III-09-E3",{"$f":"IF(OR(A176=\"\",A176=\"-\"),\"\",IFERROR(VLOOKUP($A176,[1]Tabelle2!$A:$I,B$2,FALSE),\"\"))","v":"Rittergut Viererlen"},{"$f":"IF(OR(B176=\"\",B176=\"-\"),\"\",IFERROR(VLOOKUP($A176,[1]Tabelle2!$A:$I,C$2,FALSE),\"\"))","v":"Roana von Viererlen"},{"$f":"IF(OR(C176=\"\",C176=\"-\"),\"\",IFERROR(VLOOKUP($A176,[1]Tabelle2!$A:$I,D$2,FALSE),\"\"))","v":350},{"$f":"IF(OR(D176=\"\",D176=\"-\"),\"\",IFERROR(VLOOKUP($A176,[1]Tabelle2!$A:$I,E$2,FALSE),\"\"))","v":0},350,0]
["Nor-III-09-E4",{"$f":"IF(OR(A177=\"\",A177=\"-\"),\"\",IFERROR(VLOOKUP($A177,[1]Tabelle2!$A:$I,B$2,FALSE),\"\"))","v":"Edlengut Harschfeld"},{"$f":"IF(OR(B177=\"\",B177=\"-\"),\"\",IFERROR(VLOOKUP($A177,[1]Tabelle2!$A:$I,C$2,FALSE),\"\"))","v":"-"},{"$f":"IF(OR(C177=\"\",C177=\"-\"),\"\",IFERROR(VLOOKUP($A177,[1]Tabelle2!$A:$I,D$2,FALSE),\"\"))","v":""},{"$f":"IF(OR(D177=\"\",D177=\"-\"),\"\",IFERROR(VLOOKUP($A177,[1]Tabelle2!$A:$I,E$2,FALSE),\"\"))","v":""},"",""]
["Nor-III-09-E5",{"$f":"IF(OR(A178=\"\",A178=\"-\"),\"\",IFERROR(VLOOKUP($A178,[1]Tabelle2!$A:$I,B$2,FALSE),\"\"))","v":"Edlengut Schwarzweiher"},{"$f":"IF(OR(B178=\"\",B178=\"-\"),\"\",IFERROR(VLOOKUP($A178,[1]Tabelle2!$A:$I,C$2,FALSE),\"\"))","v":"-"},{"$f":"IF(OR(C178=\"\",C178=\"-\"),\"\",IFERROR(VLOOKUP($A178,[1]Tabelle2!$A:$I,D$2,FALSE),\"\"))","v":""},{"$f":"IF(OR(D178=\"\",D178=\"-\"),\"\",IFERROR(VLOOKUP($A178,[1]Tabelle2!$A:$I,E$2,FALSE),\"\"))","v":""},"",""]
["Nor-III-09-E6",{"$f":"IF(OR(A179=\"\",A179=\"-\"),\"\",IFERROR(VLOOKUP($A179,[1]Tabelle2!$A:$I,B$2,FALSE),\"\"))","v":"Burg Hohenkranick"},{"$f":"IF(OR(B179=\"\",B179=\"-\"),\"\",IFERROR(VLOOKUP($A179,[1]Tabelle2!$A:$I,C$2,FALSE),\"\"))","v":"Domänengut des Barons"},{"$f":"IF(OR(C179=\"\",C179=\"-\"),\"\",IFERROR(VLOOKUP($A179,[1]Tabelle2!$A:$I,D$2,FALSE),\"\"))","v":540},{"$f":"IF(OR(D179=\"\",D179=\"-\"),\"\",IFERROR(VLOOKUP($A179,[1]Tabelle2!$A:$I,E$2,FALSE),\"\"))","v":0},540,0]
["Nor-III-09-E7",{"$f":"IF(OR(A180=\"\",A180=\"-\"),\"\",IFERROR(VLOOKUP($A180,[1]Tabelle2!$A:$I,B$2,FALSE),\"\"))","v":"ehem. Gut Dunkelstein"},{"$f":"IF(OR(B180=\"\",B180=\"-\"),\"\",IFERROR(VLOOKUP($A180,[1]Tabelle2!$A:$I,C$2,FALSE),\"\"))","v":"-"},{"$f":"IF(OR(C180=\"\",C180=\"-\"),\"\",IFERROR(VLOOKUP($A180,[1]Tabelle2!$A:$I,D$2,FALSE),\"\"))","v":""},{"$f":"IF(OR(D180=\"\",D180=\"-\"),\"\",IFERROR(VLOOKUP($A180,[1]Tabelle2!$A:$I,E$2,FALSE),\"\"))","v":""},"",""]
["Nor-III-10bG ",{"$f":"IF(OR(A181=\"\",A181=\"-\"),\"\",IFERROR(VLOOKUP($A181,[1]Tabelle2!$A:$I,B$2,FALSE),\"\"))","v":"Grafenmark Gratenfels "},{"$f":"IF(OR(B181=\"\",B181=\"-\"),\"\",IFERROR(VLOOKUP($A181,[1]Tabelle2!$A:$I,C$2,FALSE),\"\"))","v":"Landgraf Alrik Custodias-Greifax, vertreten durch Vogt Melcher von Ibenburg-Ibenburg "},{"$f":"IF(OR(C181=\"\",C181=\"-\"),\"\",IFERROR(VLOOKUP($A181,[1]Tabelle2!$A:$I,D$2,FALSE),\"\"))","v":9800},{"$f":"IF(OR(D181=\"\",D181=\"-\"),\"\",IFERROR(VLOOKUP($A181,[1]Tabelle2!$A:$I,E$2,FALSE),\"\"))","v":150},9950,1.507537688442211E-2]
["Nor-III-10aR ",{"$f":"IF(OR(A182=\"\",A182=\"-\"),\"\",IFERROR(VLOOKUP($A182,[1]Tabelle2!$A:$I,B$2,FALSE),\"\"))","v":"Stadt Gratenfels "},{"$f":"IF(OR(B182=\"\",B182=\"-\"),\"\",IFERROR(VLOOKUP($A182,[1]Tabelle2!$A:$I,C$2,FALSE),\"\"))","v":"Landgraf Alrik Custodias-Greifax, vertreten durch Stadtmeister Jast Iseward von Brandans Stein "},{"$f":"IF(OR(C182=\"\",C182=\"-\"),\"\",IFERROR(VLOOKUP($A182,[1]Tabelle2!$A:$I,D$2,FALSE),\"\"))","v":2200},{"$f":"IF(OR(D182=\"\",D182=\"-\"),\"\",IFERROR(VLOOKUP($A182,[1]Tabelle2!$A:$I,E$2,FALSE),\"\"))","v":50},2250,2.2222222222222223E-2]
["Nor-III-10bG-J1",{"$f":"IF(OR(A183=\"\",A183=\"-\"),\"\",IFERROR(VLOOKUP($A183,[1]Tabelle2!$A:$I,B$2,FALSE),\"\"))","v":"Junkergut Koschstein"},{"$f":"IF(OR(B183=\"\",B183=\"-\"),\"\",IFERROR(VLOOKUP($A183,[1]Tabelle2!$A:$I,C$2,FALSE),\"\"))","v":"-"},{"$f":"IF(OR(C183=\"\",C183=\"-\"),\"\",IFERROR(VLOOKUP($A183,[1]Tabelle2!$A:$I,D$2,FALSE),\"\"))","v":""},{"$f":"IF(OR(D183=\"\",D183=\"-\"),\"\",IFERROR(VLOOKUP($A183,[1]Tabelle2!$A:$I,E$2,FALSE),\"\"))","v":""},"",""]
["Nor-III-10bG-J2",{"$f":"IF(OR(A184=\"\",A184=\"-\"),\"\",IFERROR(VLOOKUP($A184,[1]Tabelle2!$A:$I,B$2,FALSE),\"\"))","v":"Junkergut Erzenschöffer"},{"$f":"IF(OR(B184=\"\",B184=\"-\"),\"\",IFERROR(VLOOKUP($A184,[1]Tabelle2!$A:$I,C$2,FALSE),\"\"))","v":"-"},{"$f":"IF(OR(C184=\"\",C184=\"-\"),\"\",IFERROR(VLOOKUP($A184,[1]Tabelle2!$A:$I,D$2,FALSE),\"\"))","v":""},{"$f":"IF(OR(D184=\"\",D184=\"-\"),\"\",IFERROR(VLOOKUP($A184,[1]Tabelle2!$A:$I,E$2,FALSE),\"\"))","v":""},"",""]
["Nor-III-10bG-J3",{"$f":"IF(OR(A185=\"\",A185=\"-\"),\"\",IFERROR(VLOOKUP($A185,[1]Tabelle2!$A:$I,B$2,FALSE),\"\"))","v":"Junkergut Neukrashof"},{"$f":"IF(OR(B185=\"\",B185=\"-\"),\"\",IFERROR(VLOOKUP($A185,[1]Tabelle2!$A:$I,C$2,FALSE),\"\"))","v":"Oldebor Greifax"},{"$f":"IF(OR(C185=\"\",C185=\"-\"),\"\",IFERROR(VLOOKUP($A185,[1]Tabelle2!$A:$I,D$2,FALSE),\"\"))","v":0},{"$f":"IF(OR(D185=\"\",D185=\"-\"),\"\",IFERROR(VLOOKUP($A185,[1]Tabelle2!$A:$I,E$2,FALSE),\"\"))","v":0},0,""]
["Nor-III-10bG-E1",{"$f":"IF(OR(A186=\"\",A186=\"-\"),\"\",IFERROR(VLOOKUP($A186,[1]Tabelle2!$A:$I,B$2,FALSE),\"\"))","v":"Edlengut Grenzmark"},{"$f":"IF(OR(B186=\"\",B186=\"-\"),\"\",IFERROR(VLOOKUP($A186,[1]Tabelle2!$A:$I,C$2,FALSE),\"\"))","v":"Gradfried von Kargenstein"},{"$f":"IF(OR(C186=\"\",C186=\"-\"),\"\",IFERROR(VLOOKUP($A186,[1]Tabelle2!$A:$I,D$2,FALSE),\"\"))","v":290},{"$f":"IF(OR(D186=\"\",D186=\"-\"),\"\",IFERROR(VLOOKUP($A186,[1]Tabelle2!$A:$I,E$2,FALSE),\"\"))","v":0},290,0]
["Nor-III-10bG-E2",{"$f":"IF(OR(A187=\"\",A187=\"-\"),\"\",IFERROR(VLOOKUP($A187,[1]Tabelle2!$A:$I,B$2,FALSE),\"\"))","v":"Edlengut Buchenweiher"},{"$f":"IF(OR(B187=\"\",B187=\"-\"),\"\",IFERROR(VLOOKUP($A187,[1]Tabelle2!$A:$I,C$2,FALSE),\"\"))","v":"-"},{"$f":"IF(OR(C187=\"\",C187=\"-\"),\"\",IFERROR(VLOOKUP($A187,[1]Tabelle2!$A:$I,D$2,FALSE),\"\"))","v":""},{"$f":"IF(OR(D187=\"\",D187=\"-\"),\"\",IFERROR(VLOOKUP($A187,[1]Tabelle2!$A:$I,E$2,FALSE),\"\"))","v":""},"",""]
["Nor-III-11 ",{"$f":"IF(OR(A188=\"\",A188=\"-\"),\"\",IFERROR(VLOOKUP($A188,[1]Tabelle2!$A:$I,B$2,FALSE),\"\"))","v":"Baronie Rickenhausen "},{"$f":"IF(OR(B188=\"\",B188=\"-\"),\"\",IFERROR(VLOOKUP($A188,[1]Tabelle2!$A:$I,C$2,FALSE),\"\"))","v":"Baronin Thalisa von Rickenhausen"},{"$f":"IF(OR(C188=\"\",C188=\"-\"),\"\",IFERROR(VLOOKUP($A188,[1]Tabelle2!$A:$I,D$2,FALSE),\"\"))","v":6900},{"$f":"IF(OR(D188=\"\",D188=\"-\"),\"\",IFERROR(VLOOKUP($A188,[1]Tabelle2!$A:$I,E$2,FALSE),\"\"))","v":0},6900,0]
["-",{"$f":"IF(OR(A189=\"\",A189=\"-\"),\"\",IFERROR(VLOOKUP($A189,[1]Tabelle2!$A:$I,B$2,FALSE),\"\"))","v":""},{"$f":"IF(OR(B189=\"\",B189=\"-\"),\"\",IFERROR(VLOOKUP($A189,[1]Tabelle2!$A:$I,C$2,FALSE),\"\"))","v":""},{"$f":"IF(OR(C189=\"\",C189=\"-\"),\"\",IFERROR(VLOOKUP($A189,[1]Tabelle2!$A:$I,D$2,FALSE),\"\"))","v":""},{"$f":"IF(OR(D189=\"\",D189=\"-\"),\"\",IFERROR(VLOOKUP($A189,[1]Tabelle2!$A:$I,E$2,FALSE),\"\"))","v":""},"",""]
["Nor-III-11-E1",{"$f":"IF(OR(A190=\"\",A190=\"-\"),\"\",IFERROR(VLOOKUP($A190,[1]Tabelle2!$A:$I,B$2,FALSE),\"\"))","v":"Edlengut Hottenbusch"},{"$f":"IF(OR(B190=\"\",B190=\"-\"),\"\",IFERROR(VLOOKUP($A190,[1]Tabelle2!$A:$I,C$2,FALSE),\"\"))","v":"Tar'anam sin Corsacca"},{"$f":"IF(OR(C190=\"\",C190=\"-\"),\"\",IFERROR(VLOOKUP($A190,[1]Tabelle2!$A:$I,D$2,FALSE),\"\"))","v":50},{"$f":"IF(OR(D190=\"\",D190=\"-\"),\"\",IFERROR(VLOOKUP($A190,[1]Tabelle2!$A:$I,E$2,FALSE),\"\"))","v":0},50,0]
["Nor-III-11-E2",{"$f":"IF(OR(A191=\"\",A191=\"-\"),\"\",IFERROR(VLOOKUP($A191,[1]Tabelle2!$A:$I,B$2,FALSE),\"\"))","v":"Edlengut Stimpenhain"},{"$f":"IF(OR(B191=\"\",B191=\"-\"),\"\",IFERROR(VLOOKUP($A191,[1]Tabelle2!$A:$I,C$2,FALSE),\"\"))","v":"Edle Marodja von Stimpenhain"},{"$f":"IF(OR(C191=\"\",C191=\"-\"),\"\",IFERROR(VLOOKUP($A191,[1]Tabelle2!$A:$I,D$2,FALSE),\"\"))","v":80},{"$f":"IF(OR(D191=\"\",D191=\"-\"),\"\",IFERROR(VLOOKUP($A191,[1]Tabelle2!$A:$I,E$2,FALSE),\"\"))","v":0},80,0]
["Nor-III-12 ",{"$f":"IF(OR(A192=\"\",A192=\"-\"),\"\",IFERROR(VLOOKUP($A192,[1]Tabelle2!$A:$I,B$2,FALSE),\"\"))","v":"Baronie Witzichenberg "},{"$f":"IF(OR(B192=\"\",B192=\"-\"),\"\",IFERROR(VLOOKUP($A192,[1]Tabelle2!$A:$I,C$2,FALSE),\"\"))","v":"Baronin Roana Eberwulf von Tannwirk "},{"$f":"IF(OR(C192=\"\",C192=\"-\"),\"\",IFERROR(VLOOKUP($A192,[1]Tabelle2!$A:$I,D$2,FALSE),\"\"))","v":8500},{"$f":"IF(OR(D192=\"\",D192=\"-\"),\"\",IFERROR(VLOOKUP($A192,[1]Tabelle2!$A:$I,E$2,FALSE),\"\"))","v":0},8500,0]
["-",{"$f":"IF(OR(A193=\"\",A193=\"-\"),\"\",IFERROR(VLOOKUP($A193,[1]Tabelle2!$A:$I,B$2,FALSE),\"\"))","v":""},{"$f":"IF(OR(B193=\"\",B193=\"-\"),\"\",IFERROR(VLOOKUP($A193,[1]Tabelle2!$A:$I,C$2,FALSE),\"\"))","v":""},{"$f":"IF(OR(C193=\"\",C193=\"-\"),\"\",IFERROR(VLOOKUP($A193,[1]Tabelle2!$A:$I,D$2,FALSE),\"\"))","v":""},{"$f":"IF(OR(D193=\"\",D193=\"-\"),\"\",IFERROR(VLOOKUP($A193,[1]Tabelle2!$A:$I,E$2,FALSE),\"\"))","v":""},"",""]
["Nor-III-12-E1",{"$f":"IF(OR(A194=\"\",A194=\"-\"),\"\",IFERROR(VLOOKUP($A194,[1]Tabelle2!$A:$I,B$2,FALSE),\"\"))","v":"-"},{"$f":"IF(OR(B194=\"\",B194=\"-\"),\"\",IFERROR(VLOOKUP($A194,[1]Tabelle2!$A:$I,C$2,FALSE),\"\"))","v":""},{"$f":"IF(OR(C194=\"\",C194=\"-\"),\"\",IFERROR(VLOOKUP($A194,[1]Tabelle2!$A:$I,D$2,FALSE),\"\"))","v":""},{"$f":"IF(OR(D194=\"\",D194=\"-\"),\"\",IFERROR(VLOOKUP($A194,[1]Tabelle2!$A:$I,E$2,FALSE),\"\"))","v":""},"",""]
["Nor-III-12-E2",{"$f":"IF(OR(A195=\"\",A195=\"-\"),\"\",IFERROR(VLOOKUP($A195,[1]Tabelle2!$A:$I,B$2,FALSE),\"\"))","v":"Edlengut Drachenstieg"},{"$f":"IF(OR(B195=\"\",B195=\"-\"),\"\",IFERROR(VLOOKUP($A195,[1]Tabelle2!$A:$I,C$2,FALSE),\"\"))","v":"Edle Nya da Re von Drachentrutz"},{"$f":"IF(OR(C195=\"\",C195=\"-\"),\"\",IFERROR(VLOOKUP($A195,[1]Tabelle2!$A:$I,D$2,FALSE),\"\"))","v":0},{"$f":"IF(OR(D195=\"\",D195=\"-\"),\"\",IFERROR(VLOOKUP($A195,[1]Tabelle2!$A:$I,E$2,FALSE),\"\"))","v":0},0,""]
["Nor-III-12-E3",{"$f":"IF(OR(A196=\"\",A196=\"-\"),\"\",IFERROR(VLOOKUP($A196,[1]Tabelle2!$A:$I,B$2,FALSE),\"\"))","v":"Edlengut Kreuzweiher"},{"$f":"IF(OR(B196=\"\",B196=\"-\"),\"\",IFERROR(VLOOKUP($A196,[1]Tabelle2!$A:$I,C$2,FALSE),\"\"))","v":"-"},{"$f":"IF(OR(C196=\"\",C196=\"-\"),\"\",IFERROR(VLOOKUP($A196,[1]Tabelle2!$A:$I,D$2,FALSE),\"\"))","v":""},{"$f":"IF(OR(D196=\"\",D196=\"-\"),\"\",IFERROR(VLOOKUP($A196,[1]Tabelle2!$A:$I,E$2,FALSE),\"\"))","v":""},{"$f":"IFERROR(D196+E196,\"\")","v":""},""]
["Nor-III-12-E4",{"$f":"IF(OR(A197=\"\",A197=\"-\"),\"\",IFERROR(VLOOKUP($A197,[1]Tabelle2!$A:$I,B$2,FALSE),\"\"))","v":"Edlengut Siebenstein"},{"$f":"IF(OR(B197=\"\",B197=\"-\"),\"\",IFERROR(VLOOKUP($A197,[1]Tabelle2!$A:$I,C$2,FALSE),\"\"))","v":"-"},{"$f":"IF(OR(C197=\"\",C197=\"-\"),\"\",IFERROR(VLOOKUP($A197,[1]Tabelle2!$A:$I,D$2,FALSE),\"\"))","v":""},{"$f":"IF(OR(D197=\"\",D197=\"-\"),\"\",IFERROR(VLOOKUP($A197,[1]Tabelle2!$A:$I,E$2,FALSE),\"\"))","v":""},"",{"$f":"IFERROR(E197/F197,\"\")","v":""}]
["Nor-III-12-E5",{"$f":"IF(OR(A198=\"\",A198=\"-\"),\"\",IFERROR(VLOOKUP($A198,[1]Tabelle2!$A:$I,B$2,FALSE),\"\"))","v":"Edlengut Weizenfeld"},{"$f":"IF(OR(B198=\"\",B198=\"-\"),\"\",IFERROR(VLOOKUP($A198,[1]Tabelle2!$A:$I,C$2,FALSE),\"\"))","v":"-"},{"$f":"IF(OR(C198=\"\",C198=\"-\"),\"\",IFERROR(VLOOKUP($A198,[1]Tabelle2!$A:$I,D$2,FALSE),\"\"))","v":""},{"$f":"IF(OR(D198=\"\",D198=\"-\"),\"\",IFERROR(VLOOKUP($A198,[1]Tabelle2!$A:$I,E$2,FALSE),\"\"))","v":""},"",""]
["Nor-III-12-E6",{"$f":"IF(OR(A199=\"\",A199=\"-\"),\"\",IFERROR(VLOOKUP($A199,[1]Tabelle2!$A:$I,B$2,FALSE),\"\"))","v":"Motte Feldertrutz"},{"$f":"IF(OR(B199=\"\",B199=\"-\"),\"\",IFERROR(VLOOKUP($A199,[1]Tabelle2!$A:$I,C$2,FALSE),\"\"))","v":"-"},{"$f":"IF(OR(C199=\"\",C199=\"-\"),\"\",IFERROR(VLOOKUP($A199,[1]Tabelle2!$A:$I,D$2,FALSE),\"\"))","v":""},{"$f":"IF(OR(D199=\"\",D199=\"-\"),\"\",IFERROR(VLOOKUP($A199,[1]Tabelle2!$A:$I,E$2,FALSE),\"\"))","v":""},"",""]
["Nor-III-13 ",{"$f":"IF(OR(A200=\"\",A200=\"-\"),\"\",IFERROR(VLOOKUP($A200,[1]Tabelle2!$A:$I,B$2,FALSE),\"\"))","v":"Baronie Schweinsfold "},{"$f":"IF(OR(B200=\"\",B200=\"-\"),\"\",IFERROR(VLOOKUP($A200,[1]Tabelle2!$A:$I,C$2,FALSE),\"\"))","v":"Baronin Selinde II von Herzogenfurt-Schweinsfold "},{"$f":"IF(OR(C200=\"\",C200=\"-\"),\"\",IFERROR(VLOOKUP($A200,[1]Tabelle2!$A:$I,D$2,FALSE),\"\"))","v":9070},{"$f":"IF(OR(D200=\"\",D200=\"-\"),\"\",IFERROR(VLOOKUP($A200,[1]Tabelle2!$A:$I,E$2,FALSE),\"\"))","v":0},9070,0]
["-",{"$f":"IF(OR(A201=\"\",A201=\"-\"),\"\",IFERROR(VLOOKUP($A201,[1]Tabelle2!$A:$I,B$2,FALSE),\"\"))","v":""},{"$f":"IF(OR(B201=\"\",B201=\"-\"),\"\",IFERROR(VLOOKUP($A201,[1]Tabelle2!$A:$I,C$2,FALSE),\"\"))","v":""},{"$f":"IF(OR(C201=\"\",C201=\"-\"),\"\",IFERROR(VLOOKUP($A201,[1]Tabelle2!$A:$I,D$2,FALSE),\"\"))","v":""},{"$f":"IF(OR(D201=\"\",D201=\"-\"),\"\",IFERROR(VLOOKUP($A201,[1]Tabelle2!$A:$I,E$2,FALSE),\"\"))","v":""},"",""]
["Nor-III-13-E1",{"$f":"IF(OR(A202=\"\",A202=\"-\"),\"\",IFERROR(VLOOKUP($A202,[1]Tabelle2!$A:$I,B$2,FALSE),\"\"))","v":"Rittergut Udenau"},{"$f":"IF(OR(B202=\"\",B202=\"-\"),\"\",IFERROR(VLOOKUP($A202,[1]Tabelle2!$A:$I,C$2,FALSE),\"\"))","v":"Haus Uden"},{"$f":"IF(OR(C202=\"\",C202=\"-\"),\"\",IFERROR(VLOOKUP($A202,[1]Tabelle2!$A:$I,D$2,FALSE),\"\"))","v":" "},{"$f":"IF(OR(D202=\"\",D202=\"-\"),\"\",IFERROR(VLOOKUP($A202,[1]Tabelle2!$A:$I,E$2,FALSE),\"\"))","v":0},"",""]
["Nor-III-13-E2",{"$f":"IF(OR(A203=\"\",A203=\"-\"),\"\",IFERROR(VLOOKUP($A203,[1]Tabelle2!$A:$I,B$2,FALSE),\"\"))","v":"Edlengut Dachswies"},{"$f":"IF(OR(B203=\"\",B203=\"-\"),\"\",IFERROR(VLOOKUP($A203,[1]Tabelle2!$A:$I,C$2,FALSE),\"\"))","v":"Haus Dachwies"},{"$f":"IF(OR(C203=\"\",C203=\"-\"),\"\",IFERROR(VLOOKUP($A203,[1]Tabelle2!$A:$I,D$2,FALSE),\"\"))","v":0},{"$f":"IF(OR(D203=\"\",D203=\"-\"),\"\",IFERROR(VLOOKUP($A203,[1]Tabelle2!$A:$I,E$2,FALSE),\"\"))","v":0},0,""]
["Nor-III-13-E3",{"$f":"IF(OR(A204=\"\",A204=\"-\"),\"\",IFERROR(VLOOKUP($A204,[1]Tabelle2!$A:$I,B$2,FALSE),\"\"))","v":"Edlengut Tsaweiler"},{"$f":"IF(OR(B204=\"\",B204=\"-\"),\"\",IFERROR(VLOOKUP($A204,[1]Tabelle2!$A:$I,C$2,FALSE),\"\"))","v":"Haus Altenberg"},{"$f":"IF(OR(C204=\"\",C204=\"-\"),\"\",IFERROR(VLOOKUP($A204,[1]Tabelle2!$A:$I,D$2,FALSE),\"\"))","v":0},{"$f":"IF(OR(D204=\"\",D204=\"-\"),\"\",IFERROR(VLOOKUP($A204,[1]Tabelle2!$A:$I,E$2,FALSE),\"\"))","v":0},0,""]
["Nor-III-13-J1",{"$f":"IF(OR(A205=\"\",A205=\"-\"),\"\",IFERROR(VLOOKUP($A205,[1]Tabelle2!$A:$I,B$2,FALSE),\"\"))","v":"Junkergut Ulmentor"},{"$f":"IF(OR(B205=\"\",B205=\"-\"),\"\",IFERROR(VLOOKUP($A205,[1]Tabelle2!$A:$I,C$2,FALSE),\"\"))","v":"Junker Gernot von Ulmentor"},{"$f":"IF(OR(C205=\"\",C205=\"-\"),\"\",IFERROR(VLOOKUP($A205,[1]Tabelle2!$A:$I,D$2,FALSE),\"\"))","v":0},{"$f":"IF(OR(D205=\"\",D205=\"-\"),\"\",IFERROR(VLOOKUP($A205,[1]Tabelle2!$A:$I,E$2,FALSE),\"\"))","v":0},0,""]
["Nor-III-13-J2",{"$f":"IF(OR(A206=\"\",A206=\"-\"),\"\",IFERROR(VLOOKUP($A206,[1]Tabelle2!$A:$I,B$2,FALSE),\"\"))","v":"Junkergut Ulenau"},{"$f":"IF(OR(B206=\"\",B206=\"-\"),\"\",IFERROR(VLOOKUP($A206,[1]Tabelle2!$A:$I,C$2,FALSE),\"\"))","v":"Junkerin Hesinja von Ulenau"},{"$f":"IF(OR(C206=\"\",C206=\"-\"),\"\",IFERROR(VLOOKUP($A206,[1]Tabelle2!$A:$I,D$2,FALSE),\"\"))","v":0},{"$f":"IF(OR(D206=\"\",D206=\"-\"),\"\",IFERROR(VLOOKUP($A206,[1]Tabelle2!$A:$I,E$2,FALSE),\"\"))","v":0},0,""]
["Nor-III-13-J3",{"$f":"IF(OR(A207=\"\",A207=\"-\"),\"\",IFERROR(VLOOKUP($A207,[1]Tabelle2!$A:$I,B$2,FALSE),\"\"))","v":"Junkergut Schweinsfold"},{"$f":"IF(OR(B207=\"\",B207=\"-\"),\"\",IFERROR(VLOOKUP($A207,[1]Tabelle2!$A:$I,C$2,FALSE),\"\"))","v":"Junker Reo von Herzogenfurt-Schweinsfold"},{"$f":"IF(OR(C207=\"\",C207=\"-\"),\"\",IFERROR(VLOOKUP($A207,[1]Tabelle2!$A:$I,D$2,FALSE),\"\"))","v":0},{"$f":"IF(OR(D207=\"\",D207=\"-\"),\"\",IFERROR(VLOOKUP($A207,[1]Tabelle2!$A:$I,E$2,FALSE),\"\"))","v":0},0,""]
["Nor-III-13-J4",{"$f":"IF(OR(A208=\"\",A208=\"-\"),\"\",IFERROR(VLOOKUP($A208,[1]Tabelle2!$A:$I,B$2,FALSE),\"\"))","v":"Junkergut Herzogenfurt"},{"$f":"IF(OR(B208=\"\",B208=\"-\"),\"\",IFERROR(VLOOKUP($A208,[1]Tabelle2!$A:$I,C$2,FALSE),\"\"))","v":"Junkerin Alrike von Henjasburg"},{"$f":"IF(OR(C208=\"\",C208=\"-\"),\"\",IFERROR(VLOOKUP($A208,[1]Tabelle2!$A:$I,D$2,FALSE),\"\"))","v":0},{"$f":"IF(OR(D208=\"\",D208=\"-\"),\"\",IFERROR(VLOOKUP($A208,[1]Tabelle2!$A:$I,E$2,FALSE),\"\"))","v":0},0,""]
["Nor-III-14 ",{"$f":"IF(OR(A209=\"\",A209=\"-\"),\"\",IFERROR(VLOOKUP($A209,[1]Tabelle2!$A:$I,B$2,FALSE),\"\"))","v":"Baronie Riedenburg "},{"$f":"IF(OR(B209=\"\",B209=\"-\"),\"\",IFERROR(VLOOKUP($A209,[1]Tabelle2!$A:$I,C$2,FALSE),\"\"))","v":"Baronin Jaslindis von der Graufurt zu Riedenburg, vertreten durch?"},{"$f":"IF(OR(C209=\"\",C209=\"-\"),\"\",IFERROR(VLOOKUP($A209,[1]Tabelle2!$A:$I,D$2,FALSE),\"\"))","v":9000},{"$f":"IF(OR(D209=\"\",D209=\"-\"),\"\",IFERROR(VLOOKUP($A209,[1]Tabelle2!$A:$I,E$2,FALSE),\"\"))","v":50},9050,5.5248618784530384E-3]
["-",{"$f":"IF(OR(A210=\"\",A210=\"-\"),\"\",IFERROR(VLOOKUP($A210,[1]Tabelle2!$A:$I,B$2,FALSE),\"\"))","v":""},{"$f":"IF(OR(B210=\"\",B210=\"-\"),\"\",IFERROR(VLOOKUP($A210,[1]Tabelle2!$A:$I,C$2,FALSE),\"\"))","v":""},{"$f":"IF(OR(C210=\"\",C210=\"-\"),\"\",IFERROR(VLOOKUP($A210,[1]Tabelle2!$A:$I,D$2,FALSE),\"\"))","v":""},{"$f":"IF(OR(D210=\"\",D210=\"-\"),\"\",IFERROR(VLOOKUP($A210,[1]Tabelle2!$A:$I,E$2,FALSE),\"\"))","v":""},"",""]
["-",{"$f":"IF(OR(A211=\"\",A211=\"-\"),\"\",IFERROR(VLOOKUP($A211,[1]Tabelle2!$A:$I,B$2,FALSE),\"\"))","v":""},{"$f":"IF(OR(B211=\"\",B211=\"-\"),\"\",IFERROR(VLOOKUP($A211,[1]Tabelle2!$A:$I,C$2,FALSE),\"\"))","v":""},{"$f":"IF(OR(C211=\"\",C211=\"-\"),\"\",IFERROR(VLOOKUP($A211,[1]Tabelle2!$A:$I,D$2,FALSE),\"\"))","v":""},{"$f":"IF(OR(D211=\"\",D211=\"-\"),\"\",IFERROR(VLOOKUP($A211,[1]Tabelle2!$A:$I,E$2,FALSE),\"\"))","v":""},"",""]
["Nor-III-14-E1 ",{"$f":"IF(OR(A212=\"\",A212=\"-\"),\"\",IFERROR(VLOOKUP($A212,[1]Tabelle2!$A:$I,B$2,FALSE),\"\"))","v":"Rittergut Graupenhof "},{"$f":"IF(OR(B212=\"\",B212=\"-\"),\"\",IFERROR(VLOOKUP($A212,[1]Tabelle2!$A:$I,C$2,FALSE),\"\"))","v":"Ritter Fradirk von Graupen "},{"$f":"IF(OR(C212=\"\",C212=\"-\"),\"\",IFERROR(VLOOKUP($A212,[1]Tabelle2!$A:$I,D$2,FALSE),\"\"))","v":450},{"$f":"IF(OR(D212=\"\",D212=\"-\"),\"\",IFERROR(VLOOKUP($A212,[1]Tabelle2!$A:$I,E$2,FALSE),\"\"))","v":0},450,0]
["Nor-III-14-E2 ",{"$f":"IF(OR(A213=\"\",A213=\"-\"),\"\",IFERROR(VLOOKUP($A213,[1]Tabelle2!$A:$I,B$2,FALSE),\"\"))","v":"Edlengut Wolfenstein "},{"$f":"IF(OR(B213=\"\",B213=\"-\"),\"\",IFERROR(VLOOKUP($A213,[1]Tabelle2!$A:$I,C$2,FALSE),\"\"))","v":"Patras von Wolf-Riedenburg"},{"$f":"IF(OR(C213=\"\",C213=\"-\"),\"\",IFERROR(VLOOKUP($A213,[1]Tabelle2!$A:$I,D$2,FALSE),\"\"))","v":450},{"$f":"IF(OR(D213=\"\",D213=\"-\"),\"\",IFERROR(VLOOKUP($A213,[1]Tabelle2!$A:$I,E$2,FALSE),\"\"))","v":0},450,0]
["Nor-III-14-E3",{"$f":"IF(OR(A214=\"\",A214=\"-\"),\"\",IFERROR(VLOOKUP($A214,[1]Tabelle2!$A:$I,B$2,FALSE),\"\"))","v":"Dorf Neumuschelstrand "},{"$f":"IF(OR(B214=\"\",B214=\"-\"),\"\",IFERROR(VLOOKUP($A214,[1]Tabelle2!$A:$I,C$2,FALSE),\"\"))","v":"-"},{"$f":"IF(OR(C214=\"\",C214=\"-\"),\"\",IFERROR(VLOOKUP($A214,[1]Tabelle2!$A:$I,D$2,FALSE),\"\"))","v":""},{"$f":"IF(OR(D214=\"\",D214=\"-\"),\"\",IFERROR(VLOOKUP($A214,[1]Tabelle2!$A:$I,E$2,FALSE),\"\"))","v":""},"",""]
["Nor-III-14-E4",{"$f":"IF(OR(A215=\"\",A215=\"-\"),\"\",IFERROR(VLOOKUP($A215,[1]Tabelle2!$A:$I,B$2,FALSE),\"\"))","v":"Stift St. Hilberian "},{"$f":"IF(OR(B215=\"\",B215=\"-\"),\"\",IFERROR(VLOOKUP($A215,[1]Tabelle2!$A:$I,C$2,FALSE),\"\"))","v":"-"},{"$f":"IF(OR(C215=\"\",C215=\"-\"),\"\",IFERROR(VLOOKUP($A215,[1]Tabelle2!$A:$I,D$2,FALSE),\"\"))","v":""},{"$f":"IF(OR(D215=\"\",D215=\"-\"),\"\",IFERROR(VLOOKUP($A215,[1]Tabelle2!$A:$I,E$2,FALSE),\"\"))","v":""},"",""]
["Nor-III-14-E5",{"$f":"IF(OR(A216=\"\",A216=\"-\"),\"\",IFERROR(VLOOKUP($A216,[1]Tabelle2!$A:$I,B$2,FALSE),\"\"))","v":"Edlengut Valposruh"},{"$f":"IF(OR(B216=\"\",B216=\"-\"),\"\",IFERROR(VLOOKUP($A216,[1]Tabelle2!$A:$I,C$2,FALSE),\"\"))","v":"Beregis Madalin von Schellenstein"},{"$f":"IF(OR(C216=\"\",C216=\"-\"),\"\",IFERROR(VLOOKUP($A216,[1]Tabelle2!$A:$I,D$2,FALSE),\"\"))","v":610},{"$f":"IF(OR(D216=\"\",D216=\"-\"),\"\",IFERROR(VLOOKUP($A216,[1]Tabelle2!$A:$I,E$2,FALSE),\"\"))","v":0},610,0]
["Nor-III-14-E6",{"$f":"IF(OR(A217=\"\",A217=\"-\"),\"\",IFERROR(VLOOKUP($A217,[1]Tabelle2!$A:$I,B$2,FALSE),\"\"))","v":"Edlengut Schnakenbühl"},{"$f":"IF(OR(B217=\"\",B217=\"-\"),\"\",IFERROR(VLOOKUP($A217,[1]Tabelle2!$A:$I,C$2,FALSE),\"\"))","v":"-"},{"$f":"IF(OR(C217=\"\",C217=\"-\"),\"\",IFERROR(VLOOKUP($A217,[1]Tabelle2!$A:$I,D$2,FALSE),\"\"))","v":""},{"$f":"IF(OR(D217=\"\",D217=\"-\"),\"\",IFERROR(VLOOKUP($A217,[1]Tabelle2!$A:$I,E$2,FALSE),\"\"))","v":""},"",""]
["Nor-III-14-E7",{"$f":"IF(OR(A218=\"\",A218=\"-\"),\"\",IFERROR(VLOOKUP($A218,[1]Tabelle2!$A:$I,B$2,FALSE),\"\"))","v":"Edlengut Valposhain"},{"$f":"IF(OR(B218=\"\",B218=\"-\"),\"\",IFERROR(VLOOKUP($A218,[1]Tabelle2!$A:$I,C$2,FALSE),\"\"))","v":"Baronin Jaslindis von der Graufurt zu Riedenburg, vertreten durch?"},{"$f":"IF(OR(C218=\"\",C218=\"-\"),\"\",IFERROR(VLOOKUP($A218,[1]Tabelle2!$A:$I,D$2,FALSE),\"\"))","v":970},{"$f":"IF(OR(D218=\"\",D218=\"-\"),\"\",IFERROR(VLOOKUP($A218,[1]Tabelle2!$A:$I,E$2,FALSE),\"\"))","v":0},970,0]
["Nor-III-14-E8",{"$f":"IF(OR(A219=\"\",A219=\"-\"),\"\",IFERROR(VLOOKUP($A219,[1]Tabelle2!$A:$I,B$2,FALSE),\"\"))","v":"Edlengut Drosselhof"},{"$f":"IF(OR(B219=\"\",B219=\"-\"),\"\",IFERROR(VLOOKUP($A219,[1]Tabelle2!$A:$I,C$2,FALSE),\"\"))","v":"xxx von Drosselhof"},{"$f":"IF(OR(C219=\"\",C219=\"-\"),\"\",IFERROR(VLOOKUP($A219,[1]Tabelle2!$A:$I,D$2,FALSE),\"\"))","v":570},{"$f":"IF(OR(D219=\"\",D219=\"-\"),\"\",IFERROR(VLOOKUP($A219,[1]Tabelle2!$A:$I,E$2,FALSE),\"\"))","v":0},570,0]
["Nor-III-14-E9",{"$f":"IF(OR(A220=\"\",A220=\"-\"),\"\",IFERROR(VLOOKUP($A220,[1]Tabelle2!$A:$I,B$2,FALSE),\"\"))","v":"Edlengut Wirselbach"},{"$f":"IF(OR(B220=\"\",B220=\"-\"),\"\",IFERROR(VLOOKUP($A220,[1]Tabelle2!$A:$I,C$2,FALSE),\"\"))","v":"-"},{"$f":"IF(OR(C220=\"\",C220=\"-\"),\"\",IFERROR(VLOOKUP($A220,[1]Tabelle2!$A:$I,D$2,FALSE),\"\"))","v":""},{"$f":"IF(OR(D220=\"\",D220=\"-\"),\"\",IFERROR(VLOOKUP($A220,[1]Tabelle2!$A:$I,E$2,FALSE),\"\"))","v":""},"",""]
["Nor-III-14-E10",{"$f":"IF(OR(A221=\"\",A221=\"-\"),\"\",IFERROR(VLOOKUP($A221,[1]Tabelle2!$A:$I,B$2,FALSE),\"\"))","v":"Edlengut ?"},{"$f":"IF(OR(B221=\"\",B221=\"-\"),\"\",IFERROR(VLOOKUP($A221,[1]Tabelle2!$A:$I,C$2,FALSE),\"\"))","v":"-"},{"$f":"IF(OR(C221=\"\",C221=\"-\"),\"\",IFERROR(VLOOKUP($A221,[1]Tabelle2!$A:$I,D$2,FALSE),\"\"))","v":""},{"$f":"IF(OR(D221=\"\",D221=\"-\"),\"\",IFERROR(VLOOKUP($A221,[1]Tabelle2!$A:$I,E$2,FALSE),\"\"))","v":""},"",""]
["Nor-III-14-E11",{"$f":"IF(OR(A222=\"\",A222=\"-\"),\"\",IFERROR(VLOOKUP($A222,[1]Tabelle2!$A:$I,B$2,FALSE),\"\"))","v":"Edlengut ?"},{"$f":"IF(OR(B222=\"\",B222=\"-\"),\"\",IFERROR(VLOOKUP($A222,[1]Tabelle2!$A:$I,C$2,FALSE),\"\"))","v":"-"},{"$f":"IF(OR(C222=\"\",C222=\"-\"),\"\",IFERROR(VLOOKUP($A222,[1]Tabelle2!$A:$I,D$2,FALSE),\"\"))","v":""},{"$f":"IF(OR(D222=\"\",D222=\"-\"),\"\",IFERROR(VLOOKUP($A222,[1]Tabelle2!$A:$I,E$2,FALSE),\"\"))","v":""},"",""]
["Nor-III-14-E12",{"$f":"IF(OR(A223=\"\",A223=\"-\"),\"\",IFERROR(VLOOKUP($A223,[1]Tabelle2!$A:$I,B$2,FALSE),\"\"))","v":"Edlengut ?"},{"$f":"IF(OR(B223=\"\",B223=\"-\"),\"\",IFERROR(VLOOKUP($A223,[1]Tabelle2!$A:$I,C$2,FALSE),\"\"))","v":"-"},{"$f":"IF(OR(C223=\"\",C223=\"-\"),\"\",IFERROR(VLOOKUP($A223,[1]Tabelle2!$A:$I,D$2,FALSE),\"\"))","v":""},{"$f":"IF(OR(D223=\"\",D223=\"-\"),\"\",IFERROR(VLOOKUP($A223,[1]Tabelle2!$A:$I,E$2,FALSE),\"\"))","v":""},"",""]
["Nor-III-15 ",{"$f":"IF(OR(A224=\"\",A224=\"-\"),\"\",IFERROR(VLOOKUP($A224,[1]Tabelle2!$A:$I,B$2,FALSE),\"\"))","v":"Baronie Schwertleihe "},{"$f":"IF(OR(B224=\"\",B224=\"-\"),\"\",IFERROR(VLOOKUP($A224,[1]Tabelle2!$A:$I,C$2,FALSE),\"\"))","v":"Baron Lechdan von Schwertleihe-Weiseprein, vertreten durch Iseweine von Weiseprein"},{"$f":"IF(OR(C224=\"\",C224=\"-\"),\"\",IFERROR(VLOOKUP($A224,[1]Tabelle2!$A:$I,D$2,FALSE),\"\"))","v":4000},{"$f":"IF(OR(D224=\"\",D224=\"-\"),\"\",IFERROR(VLOOKUP($A224,[1]Tabelle2!$A:$I,E$2,FALSE),\"\"))","v":50},4050,1.2345679012345678E-2]
["-",{"$f":"IF(OR(A225=\"\",A225=\"-\"),\"\",IFERROR(VLOOKUP($A225,[1]Tabelle2!$A:$I,B$2,FALSE),\"\"))","v":""},{"$f":"IF(OR(B225=\"\",B225=\"-\"),\"\",IFERROR(VLOOKUP($A225,[1]Tabelle2!$A:$I,C$2,FALSE),\"\"))","v":""},{"$f":"IF(OR(C225=\"\",C225=\"-\"),\"\",IFERROR(VLOOKUP($A225,[1]Tabelle2!$A:$I,D$2,FALSE),\"\"))","v":""},{"$f":"IF(OR(D225=\"\",D225=\"-\"),\"\",IFERROR(VLOOKUP($A225,[1]Tabelle2!$A:$I,E$2,FALSE),\"\"))","v":""},"",""]
["Nor-III-15-E1",{"$f":"IF(OR(A226=\"\",A226=\"-\"),\"\",IFERROR(VLOOKUP($A226,[1]Tabelle2!$A:$I,B$2,FALSE),\"\"))","v":"Gut Quellwacht"},{"$f":"IF(OR(B226=\"\",B226=\"-\"),\"\",IFERROR(VLOOKUP($A226,[1]Tabelle2!$A:$I,C$2,FALSE),\"\"))","v":"Godobald von Lanzentann"},{"$f":"IF(OR(C226=\"\",C226=\"-\"),\"\",IFERROR(VLOOKUP($A226,[1]Tabelle2!$A:$I,D$2,FALSE),\"\"))","v":0},{"$f":"IF(OR(D226=\"\",D226=\"-\"),\"\",IFERROR(VLOOKUP($A226,[1]Tabelle2!$A:$I,E$2,FALSE),\"\"))","v":0},0,""]
["Nor-III-15-E2",{"$f":"IF(OR(A227=\"\",A227=\"-\"),\"\",IFERROR(VLOOKUP($A227,[1]Tabelle2!$A:$I,B$2,FALSE),\"\"))","v":"Gut Waldmarkt"},{"$f":"IF(OR(B227=\"\",B227=\"-\"),\"\",IFERROR(VLOOKUP($A227,[1]Tabelle2!$A:$I,C$2,FALSE),\"\"))","v":"Anshold von Waldmarkt"},{"$f":"IF(OR(C227=\"\",C227=\"-\"),\"\",IFERROR(VLOOKUP($A227,[1]Tabelle2!$A:$I,D$2,FALSE),\"\"))","v":0},{"$f":"IF(OR(D227=\"\",D227=\"-\"),\"\",IFERROR(VLOOKUP($A227,[1]Tabelle2!$A:$I,E$2,FALSE),\"\"))","v":0},0,""]
["Nor-III-15-E3",{"$f":"IF(OR(A228=\"\",A228=\"-\"),\"\",IFERROR(VLOOKUP($A228,[1]Tabelle2!$A:$I,B$2,FALSE),\"\"))","v":"Gut Gräberfeld"},{"$f":"IF(OR(B228=\"\",B228=\"-\"),\"\",IFERROR(VLOOKUP($A228,[1]Tabelle2!$A:$I,C$2,FALSE),\"\"))","v":"Boronian von Gräberfeld"},{"$f":"IF(OR(C228=\"\",C228=\"-\"),\"\",IFERROR(VLOOKUP($A228,[1]Tabelle2!$A:$I,D$2,FALSE),\"\"))","v":400},{"$f":"IF(OR(D228=\"\",D228=\"-\"),\"\",IFERROR(VLOOKUP($A228,[1]Tabelle2!$A:$I,E$2,FALSE),\"\"))","v":0},400,0]
["Nor-III-15-E4",{"$f":"IF(OR(A229=\"\",A229=\"-\"),\"\",IFERROR(VLOOKUP($A229,[1]Tabelle2!$A:$I,B$2,FALSE),\"\"))","v":"Gut Rothweiher"},{"$f":"IF(OR(B229=\"\",B229=\"-\"),\"\",IFERROR(VLOOKUP($A229,[1]Tabelle2!$A:$I,C$2,FALSE),\"\"))","v":0},{"$f":"IF(OR(C229=\"\",C229=\"-\"),\"\",IFERROR(VLOOKUP($A229,[1]Tabelle2!$A:$I,D$2,FALSE),\"\"))","v":0},{"$f":"IF(OR(D229=\"\",D229=\"-\"),\"\",IFERROR(VLOOKUP($A229,[1]Tabelle2!$A:$I,E$2,FALSE),\"\"))","v":0},0,""]
["Nor-III-15-J1",{"$f":"IF(OR(A230=\"\",A230=\"-\"),\"\",IFERROR(VLOOKUP($A230,[1]Tabelle2!$A:$I,B$2,FALSE),\"\"))","v":"Junkergut Altenwein "},{"$f":"IF(OR(B230=\"\",B230=\"-\"),\"\",IFERROR(VLOOKUP($A230,[1]Tabelle2!$A:$I,C$2,FALSE),\"\"))","v":"Junker Yolhag Sturmträger von Altenwein "},{"$f":"IF(OR(C230=\"\",C230=\"-\"),\"\",IFERROR(VLOOKUP($A230,[1]Tabelle2!$A:$I,D$2,FALSE),\"\"))","v":290},{"$f":"IF(OR(D230=\"\",D230=\"-\"),\"\",IFERROR(VLOOKUP($A230,[1]Tabelle2!$A:$I,E$2,FALSE),\"\"))","v":0},290,0]
["Nor-III-16 ",{"$f":"IF(OR(A231=\"\",A231=\"-\"),\"\",IFERROR(VLOOKUP($A231,[1]Tabelle2!$A:$I,B$2,FALSE),\"\"))","v":"Baronie Galebquell "},{"$f":"IF(OR(B231=\"\",B231=\"-\"),\"\",IFERROR(VLOOKUP($A231,[1]Tabelle2!$A:$I,C$2,FALSE),\"\"))","v":"Baron Roklan von Leihenhof"},{"$f":"IF(OR(C231=\"\",C231=\"-\"),\"\",IFERROR(VLOOKUP($A231,[1]Tabelle2!$A:$I,D$2,FALSE),\"\"))","v":3500},{"$f":"IF(OR(D231=\"\",D231=\"-\"),\"\",IFERROR(VLOOKUP($A231,[1]Tabelle2!$A:$I,E$2,FALSE),\"\"))","v":50},3550,1.4084507042253521E-2]
["Nor-III-16-E1",{"$f":"IF(OR(A232=\"\",A232=\"-\"),\"\",IFERROR(VLOOKUP($A232,[1]Tabelle2!$A:$I,B$2,FALSE),\"\"))","v":"Edlengut Leihenhof"},{"$f":"IF(OR(B232=\"\",B232=\"-\"),\"\",IFERROR(VLOOKUP($A232,[1]Tabelle2!$A:$I,C$2,FALSE),\"\"))","v":"Roklan von Leihenhof"},{"$f":"IF(OR(C232=\"\",C232=\"-\"),\"\",IFERROR(VLOOKUP($A232,[1]Tabelle2!$A:$I,D$2,FALSE),\"\"))","v":0},{"$f":"IF(OR(D232=\"\",D232=\"-\"),\"\",IFERROR(VLOOKUP($A232,[1]Tabelle2!$A:$I,E$2,FALSE),\"\"))","v":0},0,""]
["Nor-III-16-E2",{"$f":"IF(OR(A233=\"\",A233=\"-\"),\"\",IFERROR(VLOOKUP($A233,[1]Tabelle2!$A:$I,B$2,FALSE),\"\"))","v":"Edlengut Lindenhof"},{"$f":"IF(OR(B233=\"\",B233=\"-\"),\"\",IFERROR(VLOOKUP($A233,[1]Tabelle2!$A:$I,C$2,FALSE),\"\"))","v":"Roklan von Leihenhof"},{"$f":"IF(OR(C233=\"\",C233=\"-\"),\"\",IFERROR(VLOOKUP($A233,[1]Tabelle2!$A:$I,D$2,FALSE),\"\"))","v":0},{"$f":"IF(OR(D233=\"\",D233=\"-\"),\"\",IFERROR(VLOOKUP($A233,[1]Tabelle2!$A:$I,E$2,FALSE),\"\"))","v":0},0,""]
["Nor-III-16-E3",{"$f":"IF(OR(A234=\"\",A234=\"-\"),\"\",IFERROR(VLOOKUP($A234,[1]Tabelle2!$A:$I,B$2,FALSE),\"\"))","v":"Edlengut Knappentreuen"},{"$f":"IF(OR(B234=\"\",B234=\"-\"),\"\",IFERROR(VLOOKUP($A234,[1]Tabelle2!$A:$I,C$2,FALSE),\"\"))","v":"Jileia von Leihenhof"},{"$f":"IF(OR(C234=\"\",C234=\"-\"),\"\",IFERROR(VLOOKUP($A234,[1]Tabelle2!$A:$I,D$2,FALSE),\"\"))","v":30},{"$f":"IF(OR(D234=\"\",D234=\"-\"),\"\",IFERROR(VLOOKUP($A234,[1]Tabelle2!$A:$I,E$2,FALSE),\"\"))","v":0},30,0]
["Nor-III-16-E4",{"$f":"IF(OR(A235=\"\",A235=\"-\"),\"\",IFERROR(VLOOKUP($A235,[1]Tabelle2!$A:$I,B$2,FALSE),\"\"))","v":"Edlengut Falkenhain"},{"$f":"IF(OR(B235=\"\",B235=\"-\"),\"\",IFERROR(VLOOKUP($A235,[1]Tabelle2!$A:$I,C$2,FALSE),\"\"))","v":"Roderich von Krotenau"},{"$f":"IF(OR(C235=\"\",C235=\"-\"),\"\",IFERROR(VLOOKUP($A235,[1]Tabelle2!$A:$I,D$2,FALSE),\"\"))","v":0},{"$f":"IF(OR(D235=\"\",D235=\"-\"),\"\",IFERROR(VLOOKUP($A235,[1]Tabelle2!$A:$I,E$2,FALSE),\"\"))","v":0},0,""]
["Nor-III-16-E5",{"$f":"IF(OR(A236=\"\",A236=\"-\"),\"\",IFERROR(VLOOKUP($A236,[1]Tabelle2!$A:$I,B$2,FALSE),\"\"))","v":"Edlengut Niederwiesen"},{"$f":"IF(OR(B236=\"\",B236=\"-\"),\"\",IFERROR(VLOOKUP($A236,[1]Tabelle2!$A:$I,C$2,FALSE),\"\"))","v":"Koradin von Unkenau"},{"$f":"IF(OR(C236=\"\",C236=\"-\"),\"\",IFERROR(VLOOKUP($A236,[1]Tabelle2!$A:$I,D$2,FALSE),\"\"))","v":50},{"$f":"IF(OR(D236=\"\",D236=\"-\"),\"\",IFERROR(VLOOKUP($A236,[1]Tabelle2!$A:$I,E$2,FALSE),\"\"))","v":0},50,0]
["Nor-III-16-E6",{"$f":"IF(OR(A237=\"\",A237=\"-\"),\"\",IFERROR(VLOOKUP($A237,[1]Tabelle2!$A:$I,B$2,FALSE),\"\"))","v":"Edlengut Lovast"},{"$f":"IF(OR(B237=\"\",B237=\"-\"),\"\",IFERROR(VLOOKUP($A237,[1]Tabelle2!$A:$I,C$2,FALSE),\"\"))","v":"vakant / heimgefallen"},{"$f":"IF(OR(C237=\"\",C237=\"-\"),\"\",IFERROR(VLOOKUP($A237,[1]Tabelle2!$A:$I,D$2,FALSE),\"\"))","v":0},{"$f":"IF(OR(D237=\"\",D237=\"-\"),\"\",IFERROR(VLOOKUP($A237,[1]Tabelle2!$A:$I,E$2,FALSE),\"\"))","v":0},0,""]
["Nor-III-16-E7",{"$f":"IF(OR(A238=\"\",A238=\"-\"),\"\",IFERROR(VLOOKUP($A238,[1]Tabelle2!$A:$I,B$2,FALSE),\"\"))","v":"Edlengut Lechminsweiher"},{"$f":"IF(OR(B238=\"\",B238=\"-\"),\"\",IFERROR(VLOOKUP($A238,[1]Tabelle2!$A:$I,C$2,FALSE),\"\"))","v":"Edler Garmwart von Grauningen"},{"$f":"IF(OR(C238=\"\",C238=\"-\"),\"\",IFERROR(VLOOKUP($A238,[1]Tabelle2!$A:$I,D$2,FALSE),\"\"))","v":0},{"$f":"IF(OR(D238=\"\",D238=\"-\"),\"\",IFERROR(VLOOKUP($A238,[1]Tabelle2!$A:$I,E$2,FALSE),\"\"))","v":0},0,""]
["Nor-III-16-J1",{"$f":"IF(OR(A239=\"\",A239=\"-\"),\"\",IFERROR(VLOOKUP($A239,[1]Tabelle2!$A:$I,B$2,FALSE),\"\"))","v":"Junkergut Hainen"},{"$f":"IF(OR(B239=\"\",B239=\"-\"),\"\",IFERROR(VLOOKUP($A239,[1]Tabelle2!$A:$I,C$2,FALSE),\"\"))","v":"Roklan von Leihenhof"},{"$f":"IF(OR(C239=\"\",C239=\"-\"),\"\",IFERROR(VLOOKUP($A239,[1]Tabelle2!$A:$I,D$2,FALSE),\"\"))","v":200},{"$f":"IF(OR(D239=\"\",D239=\"-\"),\"\",IFERROR(VLOOKUP($A239,[1]Tabelle2!$A:$I,E$2,FALSE),\"\"))","v":0},200,0]
["Nor-III-16-J2",{"$f":"IF(OR(A240=\"\",A240=\"-\"),\"\",IFERROR(VLOOKUP($A240,[1]Tabelle2!$A:$I,B$2,FALSE),\"\"))","v":"Junkergut Grasbühl"},{"$f":"IF(OR(B240=\"\",B240=\"-\"),\"\",IFERROR(VLOOKUP($A240,[1]Tabelle2!$A:$I,C$2,FALSE),\"\"))","v":"Eleonaora von Lichtenberg"},{"$f":"IF(OR(C240=\"\",C240=\"-\"),\"\",IFERROR(VLOOKUP($A240,[1]Tabelle2!$A:$I,D$2,FALSE),\"\"))","v":0},{"$f":"IF(OR(D240=\"\",D240=\"-\"),\"\",IFERROR(VLOOKUP($A240,[1]Tabelle2!$A:$I,E$2,FALSE),\"\"))","v":0},0,""]
["Nor-III-16-J3",{"$f":"IF(OR(A241=\"\",A241=\"-\"),\"\",IFERROR(VLOOKUP($A241,[1]Tabelle2!$A:$I,B$2,FALSE),\"\"))","v":"Junkergut Galebfurten"},{"$f":"IF(OR(B241=\"\",B241=\"-\"),\"\",IFERROR(VLOOKUP($A241,[1]Tabelle2!$A:$I,C$2,FALSE),\"\"))","v":"Jolenta von Galebfurten"},{"$f":"IF(OR(C241=\"\",C241=\"-\"),\"\",IFERROR(VLOOKUP($A241,[1]Tabelle2!$A:$I,D$2,FALSE),\"\"))","v":400},{"$f":"IF(OR(D241=\"\",D241=\"-\"),\"\",IFERROR(VLOOKUP($A241,[1]Tabelle2!$A:$I,E$2,FALSE),\"\"))","v":0},400,0]
["Nor-III-16-J4",{"$f":"IF(OR(A242=\"\",A242=\"-\"),\"\",IFERROR(VLOOKUP($A242,[1]Tabelle2!$A:$I,B$2,FALSE),\"\"))","v":"Junkergut Quellpass"},{"$f":"IF(OR(B242=\"\",B242=\"-\"),\"\",IFERROR(VLOOKUP($A242,[1]Tabelle2!$A:$I,C$2,FALSE),\"\"))","v":"Jolenta von Galebfurten"},{"$f":"IF(OR(C242=\"\",C242=\"-\"),\"\",IFERROR(VLOOKUP($A242,[1]Tabelle2!$A:$I,D$2,FALSE),\"\"))","v":0},{"$f":"IF(OR(D242=\"\",D242=\"-\"),\"\",IFERROR(VLOOKUP($A242,[1]Tabelle2!$A:$I,E$2,FALSE),\"\"))","v":0},0,""]
["Nor-III-16-J5",{"$f":"IF(OR(A243=\"\",A243=\"-\"),\"\",IFERROR(VLOOKUP($A243,[1]Tabelle2!$A:$I,B$2,FALSE),\"\"))","v":"Junkergut Hornisberg"},{"$f":"IF(OR(B243=\"\",B243=\"-\"),\"\",IFERROR(VLOOKUP($A243,[1]Tabelle2!$A:$I,C$2,FALSE),\"\"))","v":"Bodar von und zu Hornisberg"},{"$f":"IF(OR(C243=\"\",C243=\"-\"),\"\",IFERROR(VLOOKUP($A243,[1]Tabelle2!$A:$I,D$2,FALSE),\"\"))","v":0},{"$f":"IF(OR(D243=\"\",D243=\"-\"),\"\",IFERROR(VLOOKUP($A243,[1]Tabelle2!$A:$I,E$2,FALSE),\"\"))","v":0},0,""]
["Nor-III-16-J6",{"$f":"IF(OR(A244=\"\",A244=\"-\"),\"\",IFERROR(VLOOKUP($A244,[1]Tabelle2!$A:$I,B$2,FALSE),\"\"))","v":"Junkergut Wolfenzahn"},{"$f":"IF(OR(B244=\"\",B244=\"-\"),\"\",IFERROR(VLOOKUP($A244,[1]Tabelle2!$A:$I,C$2,FALSE),\"\"))","v":"Ronan von Lichtenberg"},{"$f":"IF(OR(C244=\"\",C244=\"-\"),\"\",IFERROR(VLOOKUP($A244,[1]Tabelle2!$A:$I,D$2,FALSE),\"\"))","v":200},{"$f":"IF(OR(D244=\"\",D244=\"-\"),\"\",IFERROR(VLOOKUP($A244,[1]Tabelle2!$A:$I,E$2,FALSE),\"\"))","v":0},200,0]
["Nor-III-17 ",{"$f":"IF(OR(A245=\"\",A245=\"-\"),\"\",IFERROR(VLOOKUP($A245,[1]Tabelle2!$A:$I,B$2,FALSE),\"\"))","v":"Baronie Orgils Heim "},{"$f":"IF(OR(B245=\"\",B245=\"-\"),\"\",IFERROR(VLOOKUP($A245,[1]Tabelle2!$A:$I,C$2,FALSE),\"\"))","v":"Baron Wolfhold von Streitzig und von Orgils Heim "},{"$f":"IF(OR(C245=\"\",C245=\"-\"),\"\",IFERROR(VLOOKUP($A245,[1]Tabelle2!$A:$I,D$2,FALSE),\"\"))","v":7300},{"$f":"IF(OR(D245=\"\",D245=\"-\"),\"\",IFERROR(VLOOKUP($A245,[1]Tabelle2!$A:$I,E$2,FALSE),\"\"))","v":0},7300,0]
["-",{"$f":"IF(OR(A246=\"\",A246=\"-\"),\"\",IFERROR(VLOOKUP($A246,[1]Tabelle2!$A:$I,B$2,FALSE),\"\"))","v":""},{"$f":"IF(OR(B246=\"\",B246=\"-\"),\"\",IFERROR(VLOOKUP($A246,[1]Tabelle2!$A:$I,C$2,FALSE),\"\"))","v":""},{"$f":"IF(OR(C246=\"\",C246=\"-\"),\"\",IFERROR(VLOOKUP($A246,[1]Tabelle2!$A:$I,D$2,FALSE),\"\"))","v":""},{"$f":"IF(OR(D246=\"\",D246=\"-\"),\"\",IFERROR(VLOOKUP($A246,[1]Tabelle2!$A:$I,E$2,FALSE),\"\"))","v":""},"",""]
["Nor-III-17-J1",{"$f":"IF(OR(A247=\"\",A247=\"-\"),\"\",IFERROR(VLOOKUP($A247,[1]Tabelle2!$A:$I,B$2,FALSE),\"\"))","v":"Junkergut Hohwiesen"},{"$f":"IF(OR(B247=\"\",B247=\"-\"),\"\",IFERROR(VLOOKUP($A247,[1]Tabelle2!$A:$I,C$2,FALSE),\"\"))","v":"Leuthwin Eisenblatt aus Udamans Sippe, Edler von Hochwiesen"},{"$f":"IF(OR(C247=\"\",C247=\"-\"),\"\",IFERROR(VLOOKUP($A247,[1]Tabelle2!$A:$I,D$2,FALSE),\"\"))","v":0},{"$f":"IF(OR(D247=\"\",D247=\"-\"),\"\",IFERROR(VLOOKUP($A247,[1]Tabelle2!$A:$I,E$2,FALSE),\"\"))","v":0},0,""]
["Nor-III-17-J2",{"$f":"IF(OR(A248=\"\",A248=\"-\"),\"\",IFERROR(VLOOKUP($A248,[1]Tabelle2!$A:$I,B$2,FALSE),\"\"))","v":"Junkergut Asselkraet "},{"$f":"IF(OR(B248=\"\",B248=\"-\"),\"\",IFERROR(VLOOKUP($A248,[1]Tabelle2!$A:$I,C$2,FALSE),\"\"))","v":"Junker Malzan von Streitzig zu Orgilsgrab "},{"$f":"IF(OR(C248=\"\",C248=\"-\"),\"\",IFERROR(VLOOKUP($A248,[1]Tabelle2!$A:$I,D$2,FALSE),\"\"))","v":1000},{"$f":"IF(OR(D248=\"\",D248=\"-\"),\"\",IFERROR(VLOOKUP($A248,[1]Tabelle2!$A:$I,E$2,FALSE),\"\"))","v":0},1000,0]
["Nor-III-17-J3",{"$f":"IF(OR(A249=\"\",A249=\"-\"),\"\",IFERROR(VLOOKUP($A249,[1]Tabelle2!$A:$I,B$2,FALSE),\"\"))","v":"Junkergut Kleinensternwacht"},{"$f":"IF(OR(B249=\"\",B249=\"-\"),\"\",IFERROR(VLOOKUP($A249,[1]Tabelle2!$A:$I,C$2,FALSE),\"\"))","v":"-"},{"$f":"IF(OR(C249=\"\",C249=\"-\"),\"\",IFERROR(VLOOKUP($A249,[1]Tabelle2!$A:$I,D$2,FALSE),\"\"))","v":""},{"$f":"IF(OR(D249=\"\",D249=\"-\"),\"\",IFERROR(VLOOKUP($A249,[1]Tabelle2!$A:$I,E$2,FALSE),\"\"))","v":""},"",""]
["Nor-III-17-K",{"$f":"IF(OR(A250=\"\",A250=\"-\"),\"\",IFERROR(VLOOKUP($A250,[1]Tabelle2!$A:$I,B$2,FALSE),\"\"))","v":"Pfalz kaiserlich Elsternhöh"},{"$f":"IF(OR(B250=\"\",B250=\"-\"),\"\",IFERROR(VLOOKUP($A250,[1]Tabelle2!$A:$I,C$2,FALSE),\"\"))","v":"Vogt Wilmibert von Bregelsaum"},{"$f":"IF(OR(C250=\"\",C250=\"-\"),\"\",IFERROR(VLOOKUP($A250,[1]Tabelle2!$A:$I,D$2,FALSE),\"\"))","v":0},{"$f":"IF(OR(D250=\"\",D250=\"-\"),\"\",IFERROR(VLOOKUP($A250,[1]Tabelle2!$A:$I,E$2,FALSE),\"\"))","v":0},0,""]
["Nor-III-18 ",{"$f":"IF(OR(A251=\"\",A251=\"-\"),\"\",IFERROR(VLOOKUP($A251,[1]Tabelle2!$A:$I,B$2,FALSE),\"\"))","v":"Baronie Berg "},{"$f":"IF(OR(B251=\"\",B251=\"-\"),\"\",IFERROR(VLOOKUP($A251,[1]Tabelle2!$A:$I,C$2,FALSE),\"\"))","v":"Baronin Grimberta Haugmin vom Großen Fluss und von Berg-Berg zum Berg auf Berg"},{"$f":"IF(OR(C251=\"\",C251=\"-\"),\"\",IFERROR(VLOOKUP($A251,[1]Tabelle2!$A:$I,D$2,FALSE),\"\"))","v":5400},{"$f":"IF(OR(D251=\"\",D251=\"-\"),\"\",IFERROR(VLOOKUP($A251,[1]Tabelle2!$A:$I,E$2,FALSE),\"\"))","v":0},5400,0]
[null,{"$f":"IF(OR(A252=\"\",A252=\"-\"),\"\",IFERROR(VLOOKUP($A252,[1]Tabelle2!$A:$I,B$2,FALSE),\"\"))","v":""},{"$f":"IF(OR(B252=\"\",B252=\"-\"),\"\",IFERROR(VLOOKUP($A252,[1]Tabelle2!$A:$I,C$2,FALSE),\"\"))","v":""},{"$f":"IF(OR(C252=\"\",C252=\"-\"),\"\",IFERROR(VLOOKUP($A252,[1]Tabelle2!$A:$I,D$2,FALSE),\"\"))","v":""},{"$f":"IF(OR(D252=\"\",D252=\"-\"),\"\",IFERROR(VLOOKUP($A252,[1]Tabelle2!$A:$I,E$2,FALSE),\"\"))","v":""},"",""]
["Nor-III-18-J1",{"$f":"IF(OR(A253=\"\",A253=\"-\"),\"\",IFERROR(VLOOKUP($A253,[1]Tabelle2!$A:$I,B$2,FALSE),\"\"))","v":"Junkergut Liannon"},{"$f":"IF(OR(B253=\"\",B253=\"-\"),\"\",IFERROR(VLOOKUP($A253,[1]Tabelle2!$A:$I,C$2,FALSE),\"\"))","v":"Baronet Ancuiras von Leihenhof"},{"$f":"IF(OR(C253=\"\",C253=\"-\"),\"\",IFERROR(VLOOKUP($A253,[1]Tabelle2!$A:$I,D$2,FALSE),\"\"))","v":0},{"$f":"IF(OR(D253=\"\",D253=\"-\"),\"\",IFERROR(VLOOKUP($A253,[1]Tabelle2!$A:$I,E$2,FALSE),\"\"))","v":0},0,""]
["Nor-III-18-J2",{"$f":"IF(OR(A254=\"\",A254=\"-\"),\"\",IFERROR(VLOOKUP($A254,[1]Tabelle2!$A:$I,B$2,FALSE),\"\"))","v":"Junkergut Zehnthof"},{"$f":"IF(OR(B254=\"\",B254=\"-\"),\"\",IFERROR(VLOOKUP($A254,[1]Tabelle2!$A:$I,C$2,FALSE),\"\"))","v":"Baronin Grimberta Haugmin vom Großen Fluss und von Berg-Berg zum Berg auf Berg"},{"$f":"IF(OR(C254=\"\",C254=\"-\"),\"\",IFERROR(VLOOKUP($A254,[1]Tabelle2!$A:$I,D$2,FALSE),\"\"))","v":0},{"$f":"IF(OR(D254=\"\",D254=\"-\"),\"\",IFERROR(VLOOKUP($A254,[1]Tabelle2!$A:$I,E$2,FALSE),\"\"))","v":0},0,""]
["Nor-III-19G ",{"$f":"IF(OR(A255=\"\",A255=\"-\"),\"\",IFERROR(VLOOKUP($A255,[1]Tabelle2!$A:$I,B$2,FALSE),\"\"))","v":"Gräflich Paggenau "},{"$f":"IF(OR(B255=\"\",B255=\"-\"),\"\",IFERROR(VLOOKUP($A255,[1]Tabelle2!$A:$I,C$2,FALSE),\"\"))","v":"Landgraf Alrik Custodias-Greifax, vertreten durch Vogt Daril von Schleiffenröchte-Sturmfels "},{"$f":"IF(OR(C255=\"\",C255=\"-\"),\"\",IFERROR(VLOOKUP($A255,[1]Tabelle2!$A:$I,D$2,FALSE),\"\"))","v":4400},{"$f":"IF(OR(D255=\"\",D255=\"-\"),\"\",IFERROR(VLOOKUP($A255,[1]Tabelle2!$A:$I,E$2,FALSE),\"\"))","v":50},4450,1.1235955056179775E-2]
["Nor-III-19G-E1",{"$f":"IF(OR(A256=\"\",A256=\"-\"),\"\",IFERROR(VLOOKUP($A256,[1]Tabelle2!$A:$I,B$2,FALSE),\"\"))","v":"Edlengut Paggenfeld"},{"$f":"IF(OR(B256=\"\",B256=\"-\"),\"\",IFERROR(VLOOKUP($A256,[1]Tabelle2!$A:$I,C$2,FALSE),\"\"))","v":"Tsadan von Paggenfeld"},{"$f":"IF(OR(C256=\"\",C256=\"-\"),\"\",IFERROR(VLOOKUP($A256,[1]Tabelle2!$A:$I,D$2,FALSE),\"\"))","v":0},{"$f":"IF(OR(D256=\"\",D256=\"-\"),\"\",IFERROR(VLOOKUP($A256,[1]Tabelle2!$A:$I,E$2,FALSE),\"\"))","v":0},0,""]
["Nor-III-19G-E2",{"$f":"IF(OR(A257=\"\",A257=\"-\"),\"\",IFERROR(VLOOKUP($A257,[1]Tabelle2!$A:$I,B$2,FALSE),\"\"))","v":"Edlengut Mistelhof"},{"$f":"IF(OR(B257=\"\",B257=\"-\"),\"\",IFERROR(VLOOKUP($A257,[1]Tabelle2!$A:$I,C$2,FALSE),\"\"))","v":"-"},{"$f":"IF(OR(C257=\"\",C257=\"-\"),\"\",IFERROR(VLOOKUP($A257,[1]Tabelle2!$A:$I,D$2,FALSE),\"\"))","v":""},{"$f":"IF(OR(D257=\"\",D257=\"-\"),\"\",IFERROR(VLOOKUP($A257,[1]Tabelle2!$A:$I,E$2,FALSE),\"\"))","v":""},"",""]
["Nor-III-19G-E3",{"$f":"IF(OR(A258=\"\",A258=\"-\"),\"\",IFERROR(VLOOKUP($A258,[1]Tabelle2!$A:$I,B$2,FALSE),\"\"))","v":"Edlengut Gorfarsthann"},{"$f":"IF(OR(B258=\"\",B258=\"-\"),\"\",IFERROR(VLOOKUP($A258,[1]Tabelle2!$A:$I,C$2,FALSE),\"\"))","v":"Tsaja von Paggenfeld"},{"$f":"IF(OR(C258=\"\",C258=\"-\"),\"\",IFERROR(VLOOKUP($A258,[1]Tabelle2!$A:$I,D$2,FALSE),\"\"))","v":0},{"$f":"IF(OR(D258=\"\",D258=\"-\"),\"\",IFERROR(VLOOKUP($A258,[1]Tabelle2!$A:$I,E$2,FALSE),\"\"))","v":0},0,""]
["Nor-III-19G-E4",{"$f":"IF(OR(A259=\"\",A259=\"-\"),\"\",IFERROR(VLOOKUP($A259,[1]Tabelle2!$A:$I,B$2,FALSE),\"\"))","v":"Edlengut Eichenhag"},{"$f":"IF(OR(B259=\"\",B259=\"-\"),\"\",IFERROR(VLOOKUP($A259,[1]Tabelle2!$A:$I,C$2,FALSE),\"\"))","v":"-"},{"$f":"IF(OR(C259=\"\",C259=\"-\"),\"\",IFERROR(VLOOKUP($A259,[1]Tabelle2!$A:$I,D$2,FALSE),\"\"))","v":""},{"$f":"IF(OR(D259=\"\",D259=\"-\"),\"\",IFERROR(VLOOKUP($A259,[1]Tabelle2!$A:$I,E$2,FALSE),\"\"))","v":""},"",""]
["Nor-III-19G-E5",{"$f":"IF(OR(A260=\"\",A260=\"-\"),\"\",IFERROR(VLOOKUP($A260,[1]Tabelle2!$A:$I,B$2,FALSE),\"\"))","v":"Edlengut Sauenhof"},{"$f":"IF(OR(B260=\"\",B260=\"-\"),\"\",IFERROR(VLOOKUP($A260,[1]Tabelle2!$A:$I,C$2,FALSE),\"\"))","v":"-"},{"$f":"IF(OR(C260=\"\",C260=\"-\"),\"\",IFERROR(VLOOKUP($A260,[1]Tabelle2!$A:$I,D$2,FALSE),\"\"))","v":""},{"$f":"IF(OR(D260=\"\",D260=\"-\"),\"\",IFERROR(VLOOKUP($A260,[1]Tabelle2!$A:$I,E$2,FALSE),\"\"))","v":""},{"$f":"IFERROR(D260+E260,\"\")","v":""},""]
["Nor-III-20 ",{"$f":"IF(OR(A261=\"\",A261=\"-\"),\"\",IFERROR(VLOOKUP($A261,[1]Tabelle2!$A:$I,B$2,FALSE),\"\"))","v":"Baronie Wolfsstein "},{"$f":"IF(OR(B261=\"\",B261=\"-\"),\"\",IFERROR(VLOOKUP($A261,[1]Tabelle2!$A:$I,C$2,FALSE),\"\"))","v":"Baronin Praiodara Winifred von Wolfsstein-Föhrenstieg"},{"$f":"IF(OR(C261=\"\",C261=\"-\"),\"\",IFERROR(VLOOKUP($A261,[1]Tabelle2!$A:$I,D$2,FALSE),\"\"))","v":4000},{"$f":"IF(OR(D261=\"\",D261=\"-\"),\"\",IFERROR(VLOOKUP($A261,[1]Tabelle2!$A:$I,E$2,FALSE),\"\"))","v":270},4270,{"$f":"IFERROR(E261/F261,\"\")","v":6.323185011709602E-2}]
["-",{"$f":"IF(OR(A262=\"\",A262=\"-\"),\"\",IFERROR(VLOOKUP($A262,[1]Tabelle2!$A:$I,B$2,FALSE),\"\"))","v":""},{"$f":"IF(OR(B262=\"\",B262=\"-\"),\"\",IFERROR(VLOOKUP($A262,[1]Tabelle2!$A:$I,C$2,FALSE),\"\"))","v":""},{"$f":"IF(OR(C262=\"\",C262=\"-\"),\"\",IFERROR(VLOOKUP($A262,[1]Tabelle2!$A:$I,D$2,FALSE),\"\"))","v":""},{"$f":"IF(OR(D262=\"\",D262=\"-\"),\"\",IFERROR(VLOOKUP($A262,[1]Tabelle2!$A:$I,E$2,FALSE),\"\"))","v":""},"",""]
["Nor-III-20-E1",{"$f":"IF(OR(A263=\"\",A263=\"-\"),\"\",IFERROR(VLOOKUP($A263,[1]Tabelle2!$A:$I,B$2,FALSE),\"\"))","v":"Edlengut Schwarzmoorgrund"},{"$f":"IF(OR(B263=\"\",B263=\"-\"),\"\",IFERROR(VLOOKUP($A263,[1]Tabelle2!$A:$I,C$2,FALSE),\"\"))","v":"Edle Rhela Praiolind von Föhrenstieg"},{"$f":"IF(OR(C263=\"\",C263=\"-\"),\"\",IFERROR(VLOOKUP($A263,[1]Tabelle2!$A:$I,D$2,FALSE),\"\"))","v":50},{"$f":"IF(OR(D263=\"\",D263=\"-\"),\"\",IFERROR(VLOOKUP($A263,[1]Tabelle2!$A:$I,E$2,FALSE),\"\"))","v":0},50,0]
["Nor-III-20-E2",{"$f":"IF(OR(A264=\"\",A264=\"-\"),\"\",IFERROR(VLOOKUP($A264,[1]Tabelle2!$A:$I,B$2,FALSE),\"\"))","v":"Edlengut Keilerswehr"},{"$f":"IF(OR(B264=\"\",B264=\"-\"),\"\",IFERROR(VLOOKUP($A264,[1]Tabelle2!$A:$I,C$2,FALSE),\"\"))","v":"Edle Phelinda von Gernebruch"},{"$f":"IF(OR(C264=\"\",C264=\"-\"),\"\",IFERROR(VLOOKUP($A264,[1]Tabelle2!$A:$I,D$2,FALSE),\"\"))","v":110},{"$f":"IF(OR(D264=\"\",D264=\"-\"),\"\",IFERROR(VLOOKUP($A264,[1]Tabelle2!$A:$I,E$2,FALSE),\"\"))","v":0},110,0]
["Nor-III-20-E3",{"$f":"IF(OR(A265=\"\",A265=\"-\"),\"\",IFERROR(VLOOKUP($A265,[1]Tabelle2!$A:$I,B$2,FALSE),\"\"))","v":"Edlengut Marderau"},{"$f":"IF(OR(B265=\"\",B265=\"-\"),\"\",IFERROR(VLOOKUP($A265,[1]Tabelle2!$A:$I,C$2,FALSE),\"\"))","v":"Edler Rakon von Wolfsstein-Schleiffenröchte"},{"$f":"IF(OR(C265=\"\",C265=\"-\"),\"\",IFERROR(VLOOKUP($A265,[1]Tabelle2!$A:$I,D$2,FALSE),\"\"))","v":90},{"$f":"IF(OR(D265=\"\",D265=\"-\"),\"\",IFERROR(VLOOKUP($A265,[1]Tabelle2!$A:$I,E$2,FALSE),\"\"))","v":0},90,0]
["Nor-III-20-E4",{"$f":"IF(OR(A266=\"\",A266=\"-\"),\"\",IFERROR(VLOOKUP($A266,[1]Tabelle2!$A:$I,B$2,FALSE),\"\"))","v":"Rittergut Fichtental"},{"$f":"IF(OR(B266=\"\",B266=\"-\"),\"\",IFERROR(VLOOKUP($A266,[1]Tabelle2!$A:$I,C$2,FALSE),\"\"))","v":"Ritter Gero Ulfing von Schwingenbach"},{"$f":"IF(OR(C266=\"\",C266=\"-\"),\"\",IFERROR(VLOOKUP($A266,[1]Tabelle2!$A:$I,D$2,FALSE),\"\"))","v":100},{"$f":"IF(OR(D266=\"\",D266=\"-\"),\"\",IFERROR(VLOOKUP($A266,[1]Tabelle2!$A:$I,E$2,FALSE),\"\"))","v":0},100,0]
["Nor-III-20-E5",{"$f":"IF(OR(A267=\"\",A267=\"-\"),\"\",IFERROR(VLOOKUP($A267,[1]Tabelle2!$A:$I,B$2,FALSE),\"\"))","v":"Edlengut Bienenturm"},{"$f":"IF(OR(B267=\"\",B267=\"-\"),\"\",IFERROR(VLOOKUP($A267,[1]Tabelle2!$A:$I,C$2,FALSE),\"\"))","v":"Edler Baldur von Bienenturm"},{"$f":"IF(OR(C267=\"\",C267=\"-\"),\"\",IFERROR(VLOOKUP($A267,[1]Tabelle2!$A:$I,D$2,FALSE),\"\"))","v":100},{"$f":"IF(OR(D267=\"\",D267=\"-\"),\"\",IFERROR(VLOOKUP($A267,[1]Tabelle2!$A:$I,E$2,FALSE),\"\"))","v":0},100,0]
["Nor-III-20-E6",{"$f":"IF(OR(A268=\"\",A268=\"-\"),\"\",IFERROR(VLOOKUP($A268,[1]Tabelle2!$A:$I,B$2,FALSE),\"\"))","v":"Rittergut Schwingenbach"},{"$f":"IF(OR(B268=\"\",B268=\"-\"),\"\",IFERROR(VLOOKUP($A268,[1]Tabelle2!$A:$I,C$2,FALSE),\"\"))","v":"Ritter Gero Ulfing von Schwingenbach"},{"$f":"IF(OR(C268=\"\",C268=\"-\"),\"\",IFERROR(VLOOKUP($A268,[1]Tabelle2!$A:$I,D$2,FALSE),\"\"))","v":0},{"$f":"IF(OR(D268=\"\",D268=\"-\"),\"\",IFERROR(VLOOKUP($A268,[1]Tabelle2!$A:$I,E$2,FALSE),\"\"))","v":0},0,""]
["Nor-III-20-J1",{"$f":"IF(OR(A269=\"\",A269=\"-\"),\"\",IFERROR(VLOOKUP($A269,[1]Tabelle2!$A:$I,B$2,FALSE),\"\"))","v":"Junkergut Tiefenfall"},{"$f":"IF(OR(B269=\"\",B269=\"-\"),\"\",IFERROR(VLOOKUP($A269,[1]Tabelle2!$A:$I,C$2,FALSE),\"\"))","v":"Junker Aureus III. von Tiefenfall"},{"$f":"IF(OR(C269=\"\",C269=\"-\"),\"\",IFERROR(VLOOKUP($A269,[1]Tabelle2!$A:$I,D$2,FALSE),\"\"))","v":55},{"$f":"IF(OR(D269=\"\",D269=\"-\"),\"\",IFERROR(VLOOKUP($A269,[1]Tabelle2!$A:$I,E$2,FALSE),\"\"))","v":0},55,0]
["Nor-III-20-J2",{"$f":"IF(OR(A270=\"\",A270=\"-\"),\"\",IFERROR(VLOOKUP($A270,[1]Tabelle2!$A:$I,B$2,FALSE),\"\"))","v":"Junkergut Nadelfels"},{"$f":"IF(OR(B270=\"\",B270=\"-\"),\"\",IFERROR(VLOOKUP($A270,[1]Tabelle2!$A:$I,C$2,FALSE),\"\"))","v":"Baroness Odila von Wolfsstein \n / Junker Wunnemar von Nadelfels, vertreten durch Burgvogt Iosep ui Niamad (umstritten)"},{"$f":"IF(OR(C270=\"\",C270=\"-\"),\"\",IFERROR(VLOOKUP($A270,[1]Tabelle2!$A:$I,D$2,FALSE),\"\"))","v":110},{"$f":"IF(OR(D270=\"\",D270=\"-\"),\"\",IFERROR(VLOOKUP($A270,[1]Tabelle2!$A:$I,E$2,FALSE),\"\"))","v":0},110,0]
["Nor-III-21 ",{"$f":"IF(OR(A271=\"\",A271=\"-\"),\"\",IFERROR(VLOOKUP($A271,[1]Tabelle2!$A:$I,B$2,FALSE),\"\"))","v":"Baronie Ludgenfels "},{"$f":"IF(OR(B271=\"\",B271=\"-\"),\"\",IFERROR(VLOOKUP($A271,[1]Tabelle2!$A:$I,C$2,FALSE),\"\"))","v":"Baron Gernot von Schepfenräupel "},{"$f":"IF(OR(C271=\"\",C271=\"-\"),\"\",IFERROR(VLOOKUP($A271,[1]Tabelle2!$A:$I,D$2,FALSE),\"\"))","v":3900},{"$f":"IF(OR(D271=\"\",D271=\"-\"),\"\",IFERROR(VLOOKUP($A271,[1]Tabelle2!$A:$I,E$2,FALSE),\"\"))","v":300},4200,7.1428571428571425E-2]
["Nor-III-21-E1",{"$f":"IF(OR(A272=\"\",A272=\"-\"),\"\",IFERROR(VLOOKUP($A272,[1]Tabelle2!$A:$I,B$2,FALSE),\"\"))","v":"Abtei Wallbronn"},{"$f":"IF(OR(B272=\"\",B272=\"-\"),\"\",IFERROR(VLOOKUP($A272,[1]Tabelle2!$A:$I,C$2,FALSE),\"\"))","v":"Chrodegang von Ibenburg-Luring"},{"$f":"IF(OR(C272=\"\",C272=\"-\"),\"\",IFERROR(VLOOKUP($A272,[1]Tabelle2!$A:$I,D$2,FALSE),\"\"))","v":0},{"$f":"IF(OR(D272=\"\",D272=\"-\"),\"\",IFERROR(VLOOKUP($A272,[1]Tabelle2!$A:$I,E$2,FALSE),\"\"))","v":0},0,""]
["Nor-III-21-E2",{"$f":"IF(OR(A273=\"\",A273=\"-\"),\"\",IFERROR(VLOOKUP($A273,[1]Tabelle2!$A:$I,B$2,FALSE),\"\"))","v":"Gut Brunnfels"},{"$f":"IF(OR(B273=\"\",B273=\"-\"),\"\",IFERROR(VLOOKUP($A273,[1]Tabelle2!$A:$I,C$2,FALSE),\"\"))","v":"xxx von Brunsböckel"},{"$f":"IF(OR(C273=\"\",C273=\"-\"),\"\",IFERROR(VLOOKUP($A273,[1]Tabelle2!$A:$I,D$2,FALSE),\"\"))","v":0},{"$f":"IF(OR(D273=\"\",D273=\"-\"),\"\",IFERROR(VLOOKUP($A273,[1]Tabelle2!$A:$I,E$2,FALSE),\"\"))","v":0},0,""]
["Nor-III-21-E3",{"$f":"IF(OR(A274=\"\",A274=\"-\"),\"\",IFERROR(VLOOKUP($A274,[1]Tabelle2!$A:$I,B$2,FALSE),\"\"))","v":"Gut Weißwassern"},{"$f":"IF(OR(B274=\"\",B274=\"-\"),\"\",IFERROR(VLOOKUP($A274,[1]Tabelle2!$A:$I,C$2,FALSE),\"\"))","v":"Edle Grisella Greifax von Mersingen"},{"$f":"IF(OR(C274=\"\",C274=\"-\"),\"\",IFERROR(VLOOKUP($A274,[1]Tabelle2!$A:$I,D$2,FALSE),\"\"))","v":0},{"$f":"IF(OR(D274=\"\",D274=\"-\"),\"\",IFERROR(VLOOKUP($A274,[1]Tabelle2!$A:$I,E$2,FALSE),\"\"))","v":0},0,""]
["Nor-III-21-J1",{"$f":"IF(OR(A275=\"\",A275=\"-\"),\"\",IFERROR(VLOOKUP($A275,[1]Tabelle2!$A:$I,B$2,FALSE),\"\"))","v":"Junkergut Wieselbusch "},{"$f":"IF(OR(B275=\"\",B275=\"-\"),\"\",IFERROR(VLOOKUP($A275,[1]Tabelle2!$A:$I,C$2,FALSE),\"\"))","v":"Junker Salix von Wieselbusch "},{"$f":"IF(OR(C275=\"\",C275=\"-\"),\"\",IFERROR(VLOOKUP($A275,[1]Tabelle2!$A:$I,D$2,FALSE),\"\"))","v":" "},{"$f":"IF(OR(D275=\"\",D275=\"-\"),\"\",IFERROR(VLOOKUP($A275,[1]Tabelle2!$A:$I,E$2,FALSE),\"\"))","v":0},"",""]
["Nor-III-21-J2",{"$f":"IF(OR(A276=\"\",A276=\"-\"),\"\",IFERROR(VLOOKUP($A276,[1]Tabelle2!$A:$I,B$2,FALSE),\"\"))","v":"Junkergut Gollhofen"},{"$f":"IF(OR(B276=\"\",B276=\"-\"),\"\",IFERROR(VLOOKUP($A276,[1]Tabelle2!$A:$I,C$2,FALSE),\"\"))","v":"Junker Ansgar von Haslach zu Gollhofen"},{"$f":"IF(OR(C276=\"\",C276=\"-\"),\"\",IFERROR(VLOOKUP($A276,[1]Tabelle2!$A:$I,D$2,FALSE),\"\"))","v":0},{"$f":"IF(OR(D276=\"\",D276=\"-\"),\"\",IFERROR(VLOOKUP($A276,[1]Tabelle2!$A:$I,E$2,FALSE),\"\"))","v":0},0,""]
["Nor-III-22 ",{"$f":"IF(OR(A277=\"\",A277=\"-\"),\"\",IFERROR(VLOOKUP($A277,[1]Tabelle2!$A:$I,B$2,FALSE),\"\"))","v":"Baronie Meilingen "},{"$f":"IF(OR(B277=\"\",B277=\"-\"),\"\",IFERROR(VLOOKUP($A277,[1]Tabelle2!$A:$I,C$2,FALSE),\"\"))","v":"Baronin Tsaja von Löwenhaupt-Berg j.H. auf Meilingen "},{"$f":"IF(OR(C277=\"\",C277=\"-\"),\"\",IFERROR(VLOOKUP($A277,[1]Tabelle2!$A:$I,D$2,FALSE),\"\"))","v":6900},{"$f":"IF(OR(D277=\"\",D277=\"-\"),\"\",IFERROR(VLOOKUP($A277,[1]Tabelle2!$A:$I,E$2,FALSE),\"\"))","v":100},7000,1.4285714285714285E-2]
["-",{"$f":"IF(OR(A278=\"\",A278=\"-\"),\"\",IFERROR(VLOOKUP($A278,[1]Tabelle2!$A:$I,B$2,FALSE),\"\"))","v":""},{"$f":"IF(OR(B278=\"\",B278=\"-\"),\"\",IFERROR(VLOOKUP($A278,[1]Tabelle2!$A:$I,C$2,FALSE),\"\"))","v":""},{"$f":"IF(OR(C278=\"\",C278=\"-\"),\"\",IFERROR(VLOOKUP($A278,[1]Tabelle2!$A:$I,D$2,FALSE),\"\"))","v":""},{"$f":"IF(OR(D278=\"\",D278=\"-\"),\"\",IFERROR(VLOOKUP($A278,[1]Tabelle2!$A:$I,E$2,FALSE),\"\"))","v":""},"",""]
["Nor-III-22-E1",{"$f":"IF(OR(A279=\"\",A279=\"-\"),\"\",IFERROR(VLOOKUP($A279,[1]Tabelle2!$A:$I,B$2,FALSE),\"\"))","v":"Edlengut Mündingen"},{"$f":"IF(OR(B279=\"\",B279=\"-\"),\"\",IFERROR(VLOOKUP($A279,[1]Tabelle2!$A:$I,C$2,FALSE),\"\"))","v":"Edler Pagol Praiowald von Föhrenstieg"},{"$f":"IF(OR(C279=\"\",C279=\"-\"),\"\",IFERROR(VLOOKUP($A279,[1]Tabelle2!$A:$I,D$2,FALSE),\"\"))","v":300},{"$f":"IF(OR(D279=\"\",D279=\"-\"),\"\",IFERROR(VLOOKUP($A279,[1]Tabelle2!$A:$I,E$2,FALSE),\"\"))","v":0},300,0]
["Nor-III-22-E2",{"$f":"IF(OR(A280=\"\",A280=\"-\"),\"\",IFERROR(VLOOKUP($A280,[1]Tabelle2!$A:$I,B$2,FALSE),\"\"))","v":"Edlengut Pappeln "},{"$f":"IF(OR(B280=\"\",B280=\"-\"),\"\",IFERROR(VLOOKUP($A280,[1]Tabelle2!$A:$I,C$2,FALSE),\"\"))","v":"Edler Dorcas von Wasserthal"},{"$f":"IF(OR(C280=\"\",C280=\"-\"),\"\",IFERROR(VLOOKUP($A280,[1]Tabelle2!$A:$I,D$2,FALSE),\"\"))","v":350},{"$f":"IF(OR(D280=\"\",D280=\"-\"),\"\",IFERROR(VLOOKUP($A280,[1]Tabelle2!$A:$I,E$2,FALSE),\"\"))","v":0},350,0]
["Nor-III-22-E3",{"$f":"IF(OR(A281=\"\",A281=\"-\"),\"\",IFERROR(VLOOKUP($A281,[1]Tabelle2!$A:$I,B$2,FALSE),\"\"))","v":"Edlengut Steineichenhof"},{"$f":"IF(OR(B281=\"\",B281=\"-\"),\"\",IFERROR(VLOOKUP($A281,[1]Tabelle2!$A:$I,C$2,FALSE),\"\"))","v":"Edle Lioba von Grauningen"},{"$f":"IF(OR(C281=\"\",C281=\"-\"),\"\",IFERROR(VLOOKUP($A281,[1]Tabelle2!$A:$I,D$2,FALSE),\"\"))","v":300},{"$f":"IF(OR(D281=\"\",D281=\"-\"),\"\",IFERROR(VLOOKUP($A281,[1]Tabelle2!$A:$I,E$2,FALSE),\"\"))","v":0},300,0]
["Nor-III-22-E4",{"$f":"IF(OR(A282=\"\",A282=\"-\"),\"\",IFERROR(VLOOKUP($A282,[1]Tabelle2!$A:$I,B$2,FALSE),\"\"))","v":"Edlengut Wolfstrutz"},{"$f":"IF(OR(B282=\"\",B282=\"-\"),\"\",IFERROR(VLOOKUP($A282,[1]Tabelle2!$A:$I,C$2,FALSE),\"\"))","v":"Edler Rondradin von Perainefurten"},{"$f":"IF(OR(C282=\"\",C282=\"-\"),\"\",IFERROR(VLOOKUP($A282,[1]Tabelle2!$A:$I,D$2,FALSE),\"\"))","v":350},{"$f":"IF(OR(D282=\"\",D282=\"-\"),\"\",IFERROR(VLOOKUP($A282,[1]Tabelle2!$A:$I,E$2,FALSE),\"\"))","v":0},350,0]
["Nor-III-22-J1",{"$f":"IF(OR(A283=\"\",A283=\"-\"),\"\",IFERROR(VLOOKUP($A283,[1]Tabelle2!$A:$I,B$2,FALSE),\"\"))","v":"Junkergut Tarlenheim"},{"$f":"IF(OR(B283=\"\",B283=\"-\"),\"\",IFERROR(VLOOKUP($A283,[1]Tabelle2!$A:$I,C$2,FALSE),\"\"))","v":"Junker Ugdalf von Löwenhaupt-Hauberach"},{"$f":"IF(OR(C283=\"\",C283=\"-\"),\"\",IFERROR(VLOOKUP($A283,[1]Tabelle2!$A:$I,D$2,FALSE),\"\"))","v":300},{"$f":"IF(OR(D283=\"\",D283=\"-\"),\"\",IFERROR(VLOOKUP($A283,[1]Tabelle2!$A:$I,E$2,FALSE),\"\"))","v":0},300,0]
["Nor-III-22-J2",{"$f":"IF(OR(A284=\"\",A284=\"-\"),\"\",IFERROR(VLOOKUP($A284,[1]Tabelle2!$A:$I,B$2,FALSE),\"\"))","v":"Junkergut Rosenfeld"},{"$f":"IF(OR(B284=\"\",B284=\"-\"),\"\",IFERROR(VLOOKUP($A284,[1]Tabelle2!$A:$I,C$2,FALSE),\"\"))","v":"Junkerin Odila von Löwenhaupt, vertreten durch Vogt Uribert Augrimmer"},{"$f":"IF(OR(C284=\"\",C284=\"-\"),\"\",IFERROR(VLOOKUP($A284,[1]Tabelle2!$A:$I,D$2,FALSE),\"\"))","v":300},{"$f":"IF(OR(D284=\"\",D284=\"-\"),\"\",IFERROR(VLOOKUP($A284,[1]Tabelle2!$A:$I,E$2,FALSE),\"\"))","v":0},300,0]
["Nor-III-22-J3",{"$f":"IF(OR(A285=\"\",A285=\"-\"),\"\",IFERROR(VLOOKUP($A285,[1]Tabelle2!$A:$I,B$2,FALSE),\"\"))","v":"Junkergut Perlensee"},{"$f":"IF(OR(B285=\"\",B285=\"-\"),\"\",IFERROR(VLOOKUP($A285,[1]Tabelle2!$A:$I,C$2,FALSE),\"\"))","v":"Junker Waldemar von Löwenhaupt"},{"$f":"IF(OR(C285=\"\",C285=\"-\"),\"\",IFERROR(VLOOKUP($A285,[1]Tabelle2!$A:$I,D$2,FALSE),\"\"))","v":450},{"$f":"IF(OR(D285=\"\",D285=\"-\"),\"\",IFERROR(VLOOKUP($A285,[1]Tabelle2!$A:$I,E$2,FALSE),\"\"))","v":0},450,0]
["Nor-III-23 ",{"$f":"IF(OR(A286=\"\",A286=\"-\"),\"\",IFERROR(VLOOKUP($A286,[1]Tabelle2!$A:$I,B$2,FALSE),\"\"))","v":"Baronie Trappenfurten "},{"$f":"IF(OR(B286=\"\",B286=\"-\"),\"\",IFERROR(VLOOKUP($A286,[1]Tabelle2!$A:$I,C$2,FALSE),\"\"))","v":"Baron Kunibald Gutbert von Tsafelde-Sturmels "},{"$f":"IF(OR(C286=\"\",C286=\"-\"),\"\",IFERROR(VLOOKUP($A286,[1]Tabelle2!$A:$I,D$2,FALSE),\"\"))","v":5100},{"$f":"IF(OR(D286=\"\",D286=\"-\"),\"\",IFERROR(VLOOKUP($A286,[1]Tabelle2!$A:$I,E$2,FALSE),\"\"))","v":0},5100,0]
["-",{"$f":"IF(OR(A287=\"\",A287=\"-\"),\"\",IFERROR(VLOOKUP($A287,[1]Tabelle2!$A:$I,B$2,FALSE),\"\"))","v":""},{"$f":"IF(OR(B287=\"\",B287=\"-\"),\"\",IFERROR(VLOOKUP($A287,[1]Tabelle2!$A:$I,C$2,FALSE),\"\"))","v":""},{"$f":"IF(OR(C287=\"\",C287=\"-\"),\"\",IFERROR(VLOOKUP($A287,[1]Tabelle2!$A:$I,D$2,FALSE),\"\"))","v":""},{"$f":"IF(OR(D287=\"\",D287=\"-\"),\"\",IFERROR(VLOOKUP($A287,[1]Tabelle2!$A:$I,E$2,FALSE),\"\"))","v":""},"",""]
["Nor-IV ",{"$f":"IF(OR(A288=\"\",A288=\"-\"),\"\",IFERROR(VLOOKUP($A288,[1]Tabelle2!$A:$I,B$2,FALSE),\"\"))","v":"Grafschaft Albenhus "},{"$f":"IF(OR(B288=\"\",B288=\"-\"),\"\",IFERROR(VLOOKUP($A288,[1]Tabelle2!$A:$I,C$2,FALSE),\"\"))","v":"Gräfin Calderine von und zu Hardenfels "},{"$f":"IF(OR(C288=\"\",C288=\"-\"),\"\",IFERROR(VLOOKUP($A288,[1]Tabelle2!$A:$I,D$2,FALSE),\"\"))","v":39250},{"$f":"IF(OR(D288=\"\",D288=\"-\"),\"\",IFERROR(VLOOKUP($A288,[1]Tabelle2!$A:$I,E$2,FALSE),\"\"))","v":2500},41750,5.9880239520958084E-2]
["Nor-IV-01G ",{"$f":"IF(OR(A289=\"\",A289=\"-\"),\"\",IFERROR(VLOOKUP($A289,[1]Tabelle2!$A:$I,B$2,FALSE),\"\"))","v":"Grafenland Albenhus "},{"$f":"IF(OR(B289=\"\",B289=\"-\"),\"\",IFERROR(VLOOKUP($A289,[1]Tabelle2!$A:$I,C$2,FALSE),\"\"))","v":"Gräfin Calderine von und zu Hardenfels, vertreten durch Vogtin Gelda von Albenhus zum Albenhus "},{"$f":"IF(OR(C289=\"\",C289=\"-\"),\"\",IFERROR(VLOOKUP($A289,[1]Tabelle2!$A:$I,D$2,FALSE),\"\"))","v":14500},{"$f":"IF(OR(D289=\"\",D289=\"-\"),\"\",IFERROR(VLOOKUP($A289,[1]Tabelle2!$A:$I,E$2,FALSE),\"\"))","v":600},15100,3.9735099337748346E-2]
["Nor-IV-01aR ",{"$f":"IF(OR(A290=\"\",A290=\"-\"),\"\",IFERROR(VLOOKUP($A290,[1]Tabelle2!$A:$I,B$2,FALSE),\"\"))","v":"Reichsstadt Albenhus "},{"$f":"IF(OR(B290=\"\",B290=\"-\"),\"\",IFERROR(VLOOKUP($A290,[1]Tabelle2!$A:$I,C$2,FALSE),\"\"))","v":"Kaiserin Rohaja von Gareth, vertreten durch Stadtvikarin Galburga von Hardenfels "},{"$f":"IF(OR(C290=\"\",C290=\"-\"),\"\",IFERROR(VLOOKUP($A290,[1]Tabelle2!$A:$I,D$2,FALSE),\"\"))","v":3100},{"$f":"IF(OR(D290=\"\",D290=\"-\"),\"\",IFERROR(VLOOKUP($A290,[1]Tabelle2!$A:$I,E$2,FALSE),\"\"))","v":550},3650,0.15068493150684931]
["Nor-IV-01-E1",{"$f":"IF(OR(A291=\"\",A291=\"-\"),\"\",IFERROR(VLOOKUP($A291,[1]Tabelle2!$A:$I,B$2,FALSE),\"\"))","v":"Edlengut Gauhaven"},{"$f":"IF(OR(B291=\"\",B291=\"-\"),\"\",IFERROR(VLOOKUP($A291,[1]Tabelle2!$A:$I,C$2,FALSE),\"\"))","v":"Edler Ensfrid von Schrötertrutz"},{"$f":"IF(OR(C291=\"\",C291=\"-\"),\"\",IFERROR(VLOOKUP($A291,[1]Tabelle2!$A:$I,D$2,FALSE),\"\"))","v":0},{"$f":"IF(OR(D291=\"\",D291=\"-\"),\"\",IFERROR(VLOOKUP($A291,[1]Tabelle2!$A:$I,E$2,FALSE),\"\"))","v":0},0,""]
["Nor-IV-01-E2",{"$f":"IF(OR(A292=\"\",A292=\"-\"),\"\",IFERROR(VLOOKUP($A292,[1]Tabelle2!$A:$I,B$2,FALSE),\"\"))","v":"Edlengut Darrenforst"},{"$f":"IF(OR(B292=\"\",B292=\"-\"),\"\",IFERROR(VLOOKUP($A292,[1]Tabelle2!$A:$I,C$2,FALSE),\"\"))","v":"Edle Witta Gunild von Dürenwald"},{"$f":"IF(OR(C292=\"\",C292=\"-\"),\"\",IFERROR(VLOOKUP($A292,[1]Tabelle2!$A:$I,D$2,FALSE),\"\"))","v":240},{"$f":"IF(OR(D292=\"\",D292=\"-\"),\"\",IFERROR(VLOOKUP($A292,[1]Tabelle2!$A:$I,E$2,FALSE),\"\"))","v":0},240,0]
["Nor-IV-01-E3",{"$f":"IF(OR(A293=\"\",A293=\"-\"),\"\",IFERROR(VLOOKUP($A293,[1]Tabelle2!$A:$I,B$2,FALSE),\"\"))","v":"Gestüt des Rahja-Tempels in Albenhus"},{"$f":"IF(OR(B293=\"\",B293=\"-\"),\"\",IFERROR(VLOOKUP($A293,[1]Tabelle2!$A:$I,C$2,FALSE),\"\"))","v":0},{"$f":"IF(OR(C293=\"\",C293=\"-\"),\"\",IFERROR(VLOOKUP($A293,[1]Tabelle2!$A:$I,D$2,FALSE),\"\"))","v":0},{"$f":"IF(OR(D293=\"\",D293=\"-\"),\"\",IFERROR(VLOOKUP($A293,[1]Tabelle2!$A:$I,E$2,FALSE),\"\"))","v":0},0,""]
["Nor-IV-02 ",{"$f":"IF(OR(A294=\"\",A294=\"-\"),\"\",IFERROR(VLOOKUP($A294,[1]Tabelle2!$A:$I,B$2,FALSE),\"\"))","v":"Baronie Hlûthars Wacht "},{"$f":"IF(OR(B294=\"\",B294=\"-\"),\"\",IFERROR(VLOOKUP($A294,[1]Tabelle2!$A:$I,C$2,FALSE),\"\"))","v":"Baron Jost Verian von Sturmfels-Maurenbrecher"},{"$f":"IF(OR(C294=\"\",C294=\"-\"),\"\",IFERROR(VLOOKUP($A294,[1]Tabelle2!$A:$I,D$2,FALSE),\"\"))","v":3500},{"$f":"IF(OR(D294=\"\",D294=\"-\"),\"\",IFERROR(VLOOKUP($A294,[1]Tabelle2!$A:$I,E$2,FALSE),\"\"))","v":50},3550,1.4084507042253521E-2]
["-",{"$f":"IF(OR(A295=\"\",A295=\"-\"),\"\",IFERROR(VLOOKUP($A295,[1]Tabelle2!$A:$I,B$2,FALSE),\"\"))","v":""},{"$f":"IF(OR(B295=\"\",B295=\"-\"),\"\",IFERROR(VLOOKUP($A295,[1]Tabelle2!$A:$I,C$2,FALSE),\"\"))","v":""},{"$f":"IF(OR(C295=\"\",C295=\"-\"),\"\",IFERROR(VLOOKUP($A295,[1]Tabelle2!$A:$I,D$2,FALSE),\"\"))","v":""},{"$f":"IF(OR(D295=\"\",D295=\"-\"),\"\",IFERROR(VLOOKUP($A295,[1]Tabelle2!$A:$I,E$2,FALSE),\"\"))","v":""},"",""]
["Nor-IV-02-E1",{"$f":"IF(OR(A296=\"\",A296=\"-\"),\"\",IFERROR(VLOOKUP($A296,[1]Tabelle2!$A:$I,B$2,FALSE),\"\"))","v":"Gut Waldsend"},{"$f":"IF(OR(B296=\"\",B296=\"-\"),\"\",IFERROR(VLOOKUP($A296,[1]Tabelle2!$A:$I,C$2,FALSE),\"\"))","v":"Jost Verian von Sturmfels-Maurenbrecher"},{"$f":"IF(OR(C296=\"\",C296=\"-\"),\"\",IFERROR(VLOOKUP($A296,[1]Tabelle2!$A:$I,D$2,FALSE),\"\"))","v":500},{"$f":"IF(OR(D296=\"\",D296=\"-\"),\"\",IFERROR(VLOOKUP($A296,[1]Tabelle2!$A:$I,E$2,FALSE),\"\"))","v":0},500,0]
["Nor-IV-02-E2",{"$f":"IF(OR(A297=\"\",A297=\"-\"),\"\",IFERROR(VLOOKUP($A297,[1]Tabelle2!$A:$I,B$2,FALSE),\"\"))","v":"Gut Finstertann"},{"$f":"IF(OR(B297=\"\",B297=\"-\"),\"\",IFERROR(VLOOKUP($A297,[1]Tabelle2!$A:$I,C$2,FALSE),\"\"))","v":"xxx"},{"$f":"IF(OR(C297=\"\",C297=\"-\"),\"\",IFERROR(VLOOKUP($A297,[1]Tabelle2!$A:$I,D$2,FALSE),\"\"))","v":500},{"$f":"IF(OR(D297=\"\",D297=\"-\"),\"\",IFERROR(VLOOKUP($A297,[1]Tabelle2!$A:$I,E$2,FALSE),\"\"))","v":0},500,0]
["Nor-IV-02-E3",{"$f":"IF(OR(A298=\"\",A298=\"-\"),\"\",IFERROR(VLOOKUP($A298,[1]Tabelle2!$A:$I,B$2,FALSE),\"\"))","v":"Rittergut Guglhof"},{"$f":"IF(OR(B298=\"\",B298=\"-\"),\"\",IFERROR(VLOOKUP($A298,[1]Tabelle2!$A:$I,C$2,FALSE),\"\"))","v":"Dora von Guglenberg"},{"$f":"IF(OR(C298=\"\",C298=\"-\"),\"\",IFERROR(VLOOKUP($A298,[1]Tabelle2!$A:$I,D$2,FALSE),\"\"))","v":400},{"$f":"IF(OR(D298=\"\",D298=\"-\"),\"\",IFERROR(VLOOKUP($A298,[1]Tabelle2!$A:$I,E$2,FALSE),\"\"))","v":0},400,0]
["Nor-IV-02-E4",{"$f":"IF(OR(A299=\"\",A299=\"-\"),\"\",IFERROR(VLOOKUP($A299,[1]Tabelle2!$A:$I,B$2,FALSE),\"\"))","v":"Rittergut Waldwacht"},{"$f":"IF(OR(B299=\"\",B299=\"-\"),\"\",IFERROR(VLOOKUP($A299,[1]Tabelle2!$A:$I,C$2,FALSE),\"\"))","v":"xxx"},{"$f":"IF(OR(C299=\"\",C299=\"-\"),\"\",IFERROR(VLOOKUP($A299,[1]Tabelle2!$A:$I,D$2,FALSE),\"\"))","v":0},{"$f":"IF(OR(D299=\"\",D299=\"-\"),\"\",IFERROR(VLOOKUP($A299,[1]Tabelle2!$A:$I,E$2,FALSE),\"\"))","v":0},0,""]
["Nor-IV-02-E5",{"$f":"IF(OR(A300=\"\",A300=\"-\"),\"\",IFERROR(VLOOKUP($A300,[1]Tabelle2!$A:$I,B$2,FALSE),\"\"))","v":"Edlengut Bergwacht"},{"$f":"IF(OR(B300=\"\",B300=\"-\"),\"\",IFERROR(VLOOKUP($A300,[1]Tabelle2!$A:$I,C$2,FALSE),\"\"))","v":"Xurtasch, Sohn des Gamasch"},{"$f":"IF(OR(C300=\"\",C300=\"-\"),\"\",IFERROR(VLOOKUP($A300,[1]Tabelle2!$A:$I,D$2,FALSE),\"\"))","v":0},{"$f":"IF(OR(D300=\"\",D300=\"-\"),\"\",IFERROR(VLOOKUP($A300,[1]Tabelle2!$A:$I,E$2,FALSE),\"\"))","v":0},0,""]
["Nor-IV-02-E6",{"$f":"IF(OR(A301=\"\",A301=\"-\"),\"\",IFERROR(VLOOKUP($A301,[1]Tabelle2!$A:$I,B$2,FALSE),\"\"))","v":"Rittergut Talwacht"},{"$f":"IF(OR(B301=\"\",B301=\"-\"),\"\",IFERROR(VLOOKUP($A301,[1]Tabelle2!$A:$I,C$2,FALSE),\"\"))","v":"xxx"},{"$f":"IF(OR(C301=\"\",C301=\"-\"),\"\",IFERROR(VLOOKUP($A301,[1]Tabelle2!$A:$I,D$2,FALSE),\"\"))","v":0},{"$f":"IF(OR(D301=\"\",D301=\"-\"),\"\",IFERROR(VLOOKUP($A301,[1]Tabelle2!$A:$I,E$2,FALSE),\"\"))","v":0},0,""]
["Nor-IV-02-J1",{"$f":"IF(OR(A302=\"\",A302=\"-\"),\"\",IFERROR(VLOOKUP($A302,[1]Tabelle2!$A:$I,B$2,FALSE),\"\"))","v":"Junkergut Flusswacht"},{"$f":"IF(OR(B302=\"\",B302=\"-\"),\"\",IFERROR(VLOOKUP($A302,[1]Tabelle2!$A:$I,C$2,FALSE),\"\"))","v":"Gundeland von und zu Flusswacht"},{"$f":"IF(OR(C302=\"\",C302=\"-\"),\"\",IFERROR(VLOOKUP($A302,[1]Tabelle2!$A:$I,D$2,FALSE),\"\"))","v":700},{"$f":"IF(OR(D302=\"\",D302=\"-\"),\"\",IFERROR(VLOOKUP($A302,[1]Tabelle2!$A:$I,E$2,FALSE),\"\"))","v":0},700,0]
["Nor-IV-02-J2",{"$f":"IF(OR(A303=\"\",A303=\"-\"),\"\",IFERROR(VLOOKUP($A303,[1]Tabelle2!$A:$I,B$2,FALSE),\"\"))","v":"Junkergut Zolling"},{"$f":"IF(OR(B303=\"\",B303=\"-\"),\"\",IFERROR(VLOOKUP($A303,[1]Tabelle2!$A:$I,C$2,FALSE),\"\"))","v":"Radulf von Grundelsee"},{"$f":"IF(OR(C303=\"\",C303=\"-\"),\"\",IFERROR(VLOOKUP($A303,[1]Tabelle2!$A:$I,D$2,FALSE),\"\"))","v":400},{"$f":"IF(OR(D303=\"\",D303=\"-\"),\"\",IFERROR(VLOOKUP($A303,[1]Tabelle2!$A:$I,E$2,FALSE),\"\"))","v":0},400,0]
["Nor-IV-03 ",{"$f":"IF(OR(A304=\"\",A304=\"-\"),\"\",IFERROR(VLOOKUP($A304,[1]Tabelle2!$A:$I,B$2,FALSE),\"\"))","v":"Baronie Gernebruch "},{"$f":"IF(OR(B304=\"\",B304=\"-\"),\"\",IFERROR(VLOOKUP($A304,[1]Tabelle2!$A:$I,C$2,FALSE),\"\"))","v":"Baronin Odrud von Gernebruch"},{"$f":"IF(OR(C304=\"\",C304=\"-\"),\"\",IFERROR(VLOOKUP($A304,[1]Tabelle2!$A:$I,D$2,FALSE),\"\"))","v":2700},{"$f":"IF(OR(D304=\"\",D304=\"-\"),\"\",IFERROR(VLOOKUP($A304,[1]Tabelle2!$A:$I,E$2,FALSE),\"\"))","v":100},2800,3.5714285714285712E-2]
["-",{"$f":"IF(OR(A305=\"\",A305=\"-\"),\"\",IFERROR(VLOOKUP($A305,[1]Tabelle2!$A:$I,B$2,FALSE),\"\"))","v":""},{"$f":"IF(OR(B305=\"\",B305=\"-\"),\"\",IFERROR(VLOOKUP($A305,[1]Tabelle2!$A:$I,C$2,FALSE),\"\"))","v":""},{"$f":"IF(OR(C305=\"\",C305=\"-\"),\"\",IFERROR(VLOOKUP($A305,[1]Tabelle2!$A:$I,D$2,FALSE),\"\"))","v":""},{"$f":"IF(OR(D305=\"\",D305=\"-\"),\"\",IFERROR(VLOOKUP($A305,[1]Tabelle2!$A:$I,E$2,FALSE),\"\"))","v":""},"",""]
["Nor-IV-03-E1",{"$f":"IF(OR(A306=\"\",A306=\"-\"),\"\",IFERROR(VLOOKUP($A306,[1]Tabelle2!$A:$I,B$2,FALSE),\"\"))","v":"Edlengut Lilienthal"},{"$f":"IF(OR(B306=\"\",B306=\"-\"),\"\",IFERROR(VLOOKUP($A306,[1]Tabelle2!$A:$I,C$2,FALSE),\"\"))","v":"Edle Calderine von Lilienthal"},{"$f":"IF(OR(C306=\"\",C306=\"-\"),\"\",IFERROR(VLOOKUP($A306,[1]Tabelle2!$A:$I,D$2,FALSE),\"\"))","v":150},{"$f":"IF(OR(D306=\"\",D306=\"-\"),\"\",IFERROR(VLOOKUP($A306,[1]Tabelle2!$A:$I,E$2,FALSE),\"\"))","v":0},150,0]
["Nor-IV-03-E2",{"$f":"IF(OR(A307=\"\",A307=\"-\"),\"\",IFERROR(VLOOKUP($A307,[1]Tabelle2!$A:$I,B$2,FALSE),\"\"))","v":"Edlengut Aarberg"},{"$f":"IF(OR(B307=\"\",B307=\"-\"),\"\",IFERROR(VLOOKUP($A307,[1]Tabelle2!$A:$I,C$2,FALSE),\"\"))","v":"Edler Albin von Aarberg, Burghauptmann zu Gernebruch "},{"$f":"IF(OR(C307=\"\",C307=\"-\"),\"\",IFERROR(VLOOKUP($A307,[1]Tabelle2!$A:$I,D$2,FALSE),\"\"))","v":150},{"$f":"IF(OR(D307=\"\",D307=\"-\"),\"\",IFERROR(VLOOKUP($A307,[1]Tabelle2!$A:$I,E$2,FALSE),\"\"))","v":10},160,6.25E-2]
["Nor-IV-03-E3",{"$f":"IF(OR(A308=\"\",A308=\"-\"),\"\",IFERROR(VLOOKUP($A308,[1]Tabelle2!$A:$I,B$2,FALSE),\"\"))","v":"Edlengut Kalterbaum"},{"$f":"IF(OR(B308=\"\",B308=\"-\"),\"\",IFERROR(VLOOKUP($A308,[1]Tabelle2!$A:$I,C$2,FALSE),\"\"))","v":"Edle Tsalinde von Kalterbaum"},{"$f":"IF(OR(C308=\"\",C308=\"-\"),\"\",IFERROR(VLOOKUP($A308,[1]Tabelle2!$A:$I,D$2,FALSE),\"\"))","v":150},{"$f":"IF(OR(D308=\"\",D308=\"-\"),\"\",IFERROR(VLOOKUP($A308,[1]Tabelle2!$A:$I,E$2,FALSE),\"\"))","v":0},150,0]
["Nor-IV-03-J1",{"$f":"IF(OR(A309=\"\",A309=\"-\"),\"\",IFERROR(VLOOKUP($A309,[1]Tabelle2!$A:$I,B$2,FALSE),\"\"))","v":"Edlengut Niedergalebra"},{"$f":"IF(OR(B309=\"\",B309=\"-\"),\"\",IFERROR(VLOOKUP($A309,[1]Tabelle2!$A:$I,C$2,FALSE),\"\"))","v":"Edler Roklan von Leihenhof"},{"$f":"IF(OR(C309=\"\",C309=\"-\"),\"\",IFERROR(VLOOKUP($A309,[1]Tabelle2!$A:$I,D$2,FALSE),\"\"))","v":300},{"$f":"IF(OR(D309=\"\",D309=\"-\"),\"\",IFERROR(VLOOKUP($A309,[1]Tabelle2!$A:$I,E$2,FALSE),\"\"))","v":0},300,0]
["Nor-IV-04 ",{"$f":"IF(OR(A310=\"\",A310=\"-\"),\"\",IFERROR(VLOOKUP($A310,[1]Tabelle2!$A:$I,B$2,FALSE),\"\"))","v":"Baronie Kaldenberg "},{"$f":"IF(OR(B310=\"\",B310=\"-\"),\"\",IFERROR(VLOOKUP($A310,[1]Tabelle2!$A:$I,C$2,FALSE),\"\"))","v":"Baron Caralus von Kaldenberg zum Kaldenberg "},{"$f":"IF(OR(C310=\"\",C310=\"-\"),\"\",IFERROR(VLOOKUP($A310,[1]Tabelle2!$A:$I,D$2,FALSE),\"\"))","v":8500},{"$f":"IF(OR(D310=\"\",D310=\"-\"),\"\",IFERROR(VLOOKUP($A310,[1]Tabelle2!$A:$I,E$2,FALSE),\"\"))","v":50},8550,5.8479532163742687E-3]
[null,{"$f":"IF(OR(A311=\"\",A311=\"-\"),\"\",IFERROR(VLOOKUP($A311,[1]Tabelle2!$A:$I,B$2,FALSE),\"\"))","v":""},{"$f":"IF(OR(B311=\"\",B311=\"-\"),\"\",IFERROR(VLOOKUP($A311,[1]Tabelle2!$A:$I,C$2,FALSE),\"\"))","v":""},{"$f":"IF(OR(C311=\"\",C311=\"-\"),\"\",IFERROR(VLOOKUP($A311,[1]Tabelle2!$A:$I,D$2,FALSE),\"\"))","v":""},{"$f":"IF(OR(D311=\"\",D311=\"-\"),\"\",IFERROR(VLOOKUP($A311,[1]Tabelle2!$A:$I,E$2,FALSE),\"\"))","v":""},"",""]
["Nor-IV-04-E1",{"$f":"IF(OR(A312=\"\",A312=\"-\"),\"\",IFERROR(VLOOKUP($A312,[1]Tabelle2!$A:$I,B$2,FALSE),\"\"))","v":"Gut Lichtenhof"},{"$f":"IF(OR(B312=\"\",B312=\"-\"),\"\",IFERROR(VLOOKUP($A312,[1]Tabelle2!$A:$I,C$2,FALSE),\"\"))","v":"Familie Albenbluth-Lichtenhof"},{"$f":"IF(OR(C312=\"\",C312=\"-\"),\"\",IFERROR(VLOOKUP($A312,[1]Tabelle2!$A:$I,D$2,FALSE),\"\"))","v":" "},{"$f":"IF(OR(D312=\"\",D312=\"-\"),\"\",IFERROR(VLOOKUP($A312,[1]Tabelle2!$A:$I,E$2,FALSE),\"\"))","v":0},"",""]
["Nor-IV-04-E2",{"$f":"IF(OR(A313=\"\",A313=\"-\"),\"\",IFERROR(VLOOKUP($A313,[1]Tabelle2!$A:$I,B$2,FALSE),\"\"))","v":"Gut Klammburg"},{"$f":"IF(OR(B313=\"\",B313=\"-\"),\"\",IFERROR(VLOOKUP($A313,[1]Tabelle2!$A:$I,C$2,FALSE),\"\"))","v":"Ulinai von Heiternacht"},{"$f":"IF(OR(C313=\"\",C313=\"-\"),\"\",IFERROR(VLOOKUP($A313,[1]Tabelle2!$A:$I,D$2,FALSE),\"\"))","v":" "},{"$f":"IF(OR(D313=\"\",D313=\"-\"),\"\",IFERROR(VLOOKUP($A313,[1]Tabelle2!$A:$I,E$2,FALSE),\"\"))","v":0},"",""]
["Nor-IV-04-E3",{"$f":"IF(OR(A314=\"\",A314=\"-\"),\"\",IFERROR(VLOOKUP($A314,[1]Tabelle2!$A:$I,B$2,FALSE),\"\"))","v":"Edlengut Bollstieg"},{"$f":"IF(OR(B314=\"\",B314=\"-\"),\"\",IFERROR(VLOOKUP($A314,[1]Tabelle2!$A:$I,C$2,FALSE),\"\"))","v":"Edler Anshelm von Bollstieg"},{"$f":"IF(OR(C314=\"\",C314=\"-\"),\"\",IFERROR(VLOOKUP($A314,[1]Tabelle2!$A:$I,D$2,FALSE),\"\"))","v":0},{"$f":"IF(OR(D314=\"\",D314=\"-\"),\"\",IFERROR(VLOOKUP($A314,[1]Tabelle2!$A:$I,E$2,FALSE),\"\"))","v":0},0,""]
["Nor-IV-04-E4",{"$f":"IF(OR(A315=\"\",A315=\"-\"),\"\",IFERROR(VLOOKUP($A315,[1]Tabelle2!$A:$I,B$2,FALSE),\"\"))","v":"Rittergut Weinburg "},{"$f":"IF(OR(B315=\"\",B315=\"-\"),\"\",IFERROR(VLOOKUP($A315,[1]Tabelle2!$A:$I,C$2,FALSE),\"\"))","v":"Ritter Hadwig von Weinburg "},{"$f":"IF(OR(C315=\"\",C315=\"-\"),\"\",IFERROR(VLOOKUP($A315,[1]Tabelle2!$A:$I,D$2,FALSE),\"\"))","v":0},{"$f":"IF(OR(D315=\"\",D315=\"-\"),\"\",IFERROR(VLOOKUP($A315,[1]Tabelle2!$A:$I,E$2,FALSE),\"\"))","v":0},0,""]
["Nor-IV-04-E5",{"$f":"IF(OR(A316=\"\",A316=\"-\"),\"\",IFERROR(VLOOKUP($A316,[1]Tabelle2!$A:$I,B$2,FALSE),\"\"))","v":"Edlengut Rodenwehr"},{"$f":"IF(OR(B316=\"\",B316=\"-\"),\"\",IFERROR(VLOOKUP($A316,[1]Tabelle2!$A:$I,C$2,FALSE),\"\"))","v":"Edle/-r x von Rodenwehr"},{"$f":"IF(OR(C316=\"\",C316=\"-\"),\"\",IFERROR(VLOOKUP($A316,[1]Tabelle2!$A:$I,D$2,FALSE),\"\"))","v":900},{"$f":"IF(OR(D316=\"\",D316=\"-\"),\"\",IFERROR(VLOOKUP($A316,[1]Tabelle2!$A:$I,E$2,FALSE),\"\"))","v":0},900,0]
["Nor-IV-05K ",{"$f":"IF(OR(A317=\"\",A317=\"-\"),\"\",IFERROR(VLOOKUP($A317,[1]Tabelle2!$A:$I,B$2,FALSE),\"\"))","v":"Kaiserlich Weidleth "},{"$f":"IF(OR(B317=\"\",B317=\"-\"),\"\",IFERROR(VLOOKUP($A317,[1]Tabelle2!$A:$I,C$2,FALSE),\"\"))","v":"Kaiserin Rohaja von Gareth, vertreten durch Reichsvogtin Yolande von Mersingen ä.H. "},{"$f":"IF(OR(C317=\"\",C317=\"-\"),\"\",IFERROR(VLOOKUP($A317,[1]Tabelle2!$A:$I,D$2,FALSE),\"\"))","v":4200},{"$f":"IF(OR(D317=\"\",D317=\"-\"),\"\",IFERROR(VLOOKUP($A317,[1]Tabelle2!$A:$I,E$2,FALSE),\"\"))","v":450},4650,9.6774193548387094E-2]
["Nor-IV-05K-E1",{"$f":"IF(OR(A318=\"\",A318=\"-\"),\"\",IFERROR(VLOOKUP($A318,[1]Tabelle2!$A:$I,B$2,FALSE),\"\"))","v":"Gut Hungersteg"},{"$f":"IF(OR(B318=\"\",B318=\"-\"),\"\",IFERROR(VLOOKUP($A318,[1]Tabelle2!$A:$I,C$2,FALSE),\"\"))","v":"Welfert von Mersingen ä.H."},{"$f":"IF(OR(C318=\"\",C318=\"-\"),\"\",IFERROR(VLOOKUP($A318,[1]Tabelle2!$A:$I,D$2,FALSE),\"\"))","v":450},{"$f":"IF(OR(D318=\"\",D318=\"-\"),\"\",IFERROR(VLOOKUP($A318,[1]Tabelle2!$A:$I,E$2,FALSE),\"\"))","v":0},450,0]
[null,{"$f":"IF(OR(A319=\"\",A319=\"-\"),\"\",IFERROR(VLOOKUP($A319,[1]Tabelle2!$A:$I,B$2,FALSE),\"\"))","v":""},{"$f":"IF(OR(B319=\"\",B319=\"-\"),\"\",IFERROR(VLOOKUP($A319,[1]Tabelle2!$A:$I,C$2,FALSE),\"\"))","v":""},{"$f":"IF(OR(C319=\"\",C319=\"-\"),\"\",IFERROR(VLOOKUP($A319,[1]Tabelle2!$A:$I,D$2,FALSE),\"\"))","v":""},{"$f":"IF(OR(D319=\"\",D319=\"-\"),\"\",IFERROR(VLOOKUP($A319,[1]Tabelle2!$A:$I,E$2,FALSE),\"\"))","v":""},"",""]
["Nor-IV-05K-E2",{"$f":"IF(OR(A320=\"\",A320=\"-\"),\"\",IFERROR(VLOOKUP($A320,[1]Tabelle2!$A:$I,B$2,FALSE),\"\"))","v":"Rittergut Dornwald"},{"$f":"IF(OR(B320=\"\",B320=\"-\"),\"\",IFERROR(VLOOKUP($A320,[1]Tabelle2!$A:$I,C$2,FALSE),\"\"))","v":"Ritter Wolfhardt von Dornhart"},{"$f":"IF(OR(C320=\"\",C320=\"-\"),\"\",IFERROR(VLOOKUP($A320,[1]Tabelle2!$A:$I,D$2,FALSE),\"\"))","v":440},{"$f":"IF(OR(D320=\"\",D320=\"-\"),\"\",IFERROR(VLOOKUP($A320,[1]Tabelle2!$A:$I,E$2,FALSE),\"\"))","v":0},440,0]
["Nor-IV-05K-E3",{"$f":"IF(OR(A321=\"\",A321=\"-\"),\"\",IFERROR(VLOOKUP($A321,[1]Tabelle2!$A:$I,B$2,FALSE),\"\"))","v":"Edlengut Pervalsstieg"},{"$f":"IF(OR(B321=\"\",B321=\"-\"),\"\",IFERROR(VLOOKUP($A321,[1]Tabelle2!$A:$I,C$2,FALSE),\"\"))","v":"Edler Nimmgalf von Hirschfurten, vertreten durch Odrud von Hirschfurten"},{"$f":"IF(OR(C321=\"\",C321=\"-\"),\"\",IFERROR(VLOOKUP($A321,[1]Tabelle2!$A:$I,D$2,FALSE),\"\"))","v":550},{"$f":"IF(OR(D321=\"\",D321=\"-\"),\"\",IFERROR(VLOOKUP($A321,[1]Tabelle2!$A:$I,E$2,FALSE),\"\"))","v":230},780,0.29487179487179488]
["Nor-IV-06 ",{"$f":"IF(OR(A322=\"\",A322=\"-\"),\"\",IFERROR(VLOOKUP($A322,[1]Tabelle2!$A:$I,B$2,FALSE),\"\"))","v":"Baronie Liepenstein "},{"$f":"IF(OR(B322=\"\",B322=\"-\"),\"\",IFERROR(VLOOKUP($A322,[1]Tabelle2!$A:$I,C$2,FALSE),\"\"))","v":"Baronin Gundela von Liepenstein zum Liepenstein "},{"$f":"IF(OR(C322=\"\",C322=\"-\"),\"\",IFERROR(VLOOKUP($A322,[1]Tabelle2!$A:$I,D$2,FALSE),\"\"))","v":3450},{"$f":"IF(OR(D322=\"\",D322=\"-\"),\"\",IFERROR(VLOOKUP($A322,[1]Tabelle2!$A:$I,E$2,FALSE),\"\"))","v":900},4350,0.20689655172413793]
["-",{"$f":"IF(OR(A323=\"\",A323=\"-\"),\"\",IFERROR(VLOOKUP($A323,[1]Tabelle2!$A:$I,B$2,FALSE),\"\"))","v":""},{"$f":"IF(OR(B323=\"\",B323=\"-\"),\"\",IFERROR(VLOOKUP($A323,[1]Tabelle2!$A:$I,C$2,FALSE),\"\"))","v":""},{"$f":"IF(OR(C323=\"\",C323=\"-\"),\"\",IFERROR(VLOOKUP($A323,[1]Tabelle2!$A:$I,D$2,FALSE),\"\"))","v":""},{"$f":"IF(OR(D323=\"\",D323=\"-\"),\"\",IFERROR(VLOOKUP($A323,[1]Tabelle2!$A:$I,E$2,FALSE),\"\"))","v":""},"",""]
["-",{"$f":"IF(OR(A324=\"\",A324=\"-\"),\"\",IFERROR(VLOOKUP($A324,[1]Tabelle2!$A:$I,B$2,FALSE),\"\"))","v":""},{"$f":"IF(OR(B324=\"\",B324=\"-\"),\"\",IFERROR(VLOOKUP($A324,[1]Tabelle2!$A:$I,C$2,FALSE),\"\"))","v":""},{"$f":"IF(OR(C324=\"\",C324=\"-\"),\"\",IFERROR(VLOOKUP($A324,[1]Tabelle2!$A:$I,D$2,FALSE),\"\"))","v":""},{"$f":"IF(OR(D324=\"\",D324=\"-\"),\"\",IFERROR(VLOOKUP($A324,[1]Tabelle2!$A:$I,E$2,FALSE),\"\"))","v":""},{"$f":"IFERROR(D324+E324,\"\")","v":""},""]
["Nor-IV-06-E1",{"$f":"IF(OR(A325=\"\",A325=\"-\"),\"\",IFERROR(VLOOKUP($A325,[1]Tabelle2!$A:$I,B$2,FALSE),\"\"))","v":"Gut Trackenborn"},{"$f":"IF(OR(B325=\"\",B325=\"-\"),\"\",IFERROR(VLOOKUP($A325,[1]Tabelle2!$A:$I,C$2,FALSE),\"\"))","v":"-"},{"$f":"IF(OR(C325=\"\",C325=\"-\"),\"\",IFERROR(VLOOKUP($A325,[1]Tabelle2!$A:$I,D$2,FALSE),\"\"))","v":""},{"$f":"IF(OR(D325=\"\",D325=\"-\"),\"\",IFERROR(VLOOKUP($A325,[1]Tabelle2!$A:$I,E$2,FALSE),\"\"))","v":""},"",{"$f":"IFERROR(E325/F325,\"\")","v":""}]
["Nor-IV-06-E2",{"$f":"IF(OR(A326=\"\",A326=\"-\"),\"\",IFERROR(VLOOKUP($A326,[1]Tabelle2!$A:$I,B$2,FALSE),\"\"))","v":"Gut Wolfentrutz"},{"$f":"IF(OR(B326=\"\",B326=\"-\"),\"\",IFERROR(VLOOKUP($A326,[1]Tabelle2!$A:$I,C$2,FALSE),\"\"))","v":"Salbirg von Wolfentrutz"},{"$f":"IF(OR(C326=\"\",C326=\"-\"),\"\",IFERROR(VLOOKUP($A326,[1]Tabelle2!$A:$I,D$2,FALSE),\"\"))","v":0},{"$f":"IF(OR(D326=\"\",D326=\"-\"),\"\",IFERROR(VLOOKUP($A326,[1]Tabelle2!$A:$I,E$2,FALSE),\"\"))","v":0},0,""]
["Nor-IV-06-J1",{"$f":"IF(OR(A327=\"\",A327=\"-\"),\"\",IFERROR(VLOOKUP($A327,[1]Tabelle2!$A:$I,B$2,FALSE),\"\"))","v":"Gut Finsterklamm"},{"$f":"IF(OR(B327=\"\",B327=\"-\"),\"\",IFERROR(VLOOKUP($A327,[1]Tabelle2!$A:$I,C$2,FALSE),\"\"))","v":"Baron Roklan von Leihenhof, vertreten durch Alissa von Leihenhof"},{"$f":"IF(OR(C327=\"\",C327=\"-\"),\"\",IFERROR(VLOOKUP($A327,[1]Tabelle2!$A:$I,D$2,FALSE),\"\"))","v":200},{"$f":"IF(OR(D327=\"\",D327=\"-\"),\"\",IFERROR(VLOOKUP($A327,[1]Tabelle2!$A:$I,E$2,FALSE),\"\"))","v":0},200,0]
["Nor-IV-07PG ",{"$f":"IF(OR(A328=\"\",A328=\"-\"),\"\",IFERROR(VLOOKUP($A328,[1]Tabelle2!$A:$I,B$2,FALSE),\"\"))","v":"Pfalzgrafschaft Albengau "},{"$f":"IF(OR(B328=\"\",B328=\"-\"),\"\",IFERROR(VLOOKUP($A328,[1]Tabelle2!$A:$I,C$2,FALSE),\"\"))","v":"Kaiserin Rohaja von Gareth, vertreten durch Pfalzgräfin Niam Feenwasser v. Albengau"},{"$f":"IF(OR(C328=\"\",C328=\"-\"),\"\",IFERROR(VLOOKUP($A328,[1]Tabelle2!$A:$I,D$2,FALSE),\"\"))","v":2400},{"$f":"IF(OR(D328=\"\",D328=\"-\"),\"\",IFERROR(VLOOKUP($A328,[1]Tabelle2!$A:$I,E$2,FALSE),\"\"))","v":350},2750,0.12727272727272726]
["Nor-IV-07PG-E1",{"$f":"IF(OR(A329=\"\",A329=\"-\"),\"\",IFERROR(VLOOKUP($A329,[1]Tabelle2!$A:$I,B$2,FALSE),\"\"))","v":"Edlengut Treuwinckel"},{"$f":"IF(OR(B329=\"\",B329=\"-\"),\"\",IFERROR(VLOOKUP($A329,[1]Tabelle2!$A:$I,C$2,FALSE),\"\"))","v":"Ritter Raulbrecht Praiodan von Gorsingen"},{"$f":"IF(OR(C329=\"\",C329=\"-\"),\"\",IFERROR(VLOOKUP($A329,[1]Tabelle2!$A:$I,D$2,FALSE),\"\"))","v":0},{"$f":"IF(OR(D329=\"\",D329=\"-\"),\"\",IFERROR(VLOOKUP($A329,[1]Tabelle2!$A:$I,E$2,FALSE),\"\"))","v":0},0,""]

{"sheet":"Modul1","index":9,"n_rows":0,"n_cols":0,"rows_kept":0,"cut":false,"hidden":true,"merged":[]}