{"text_format":"1","workbook":"xlsx","n_sheets":10,"sheets":["Startseite","Würfe","Allgemeines","Einnahmen","Ausgaben","Unterhalt","Bilanz","Tabellen","Census","Modul1"],"not_rendered":{"charts":0,"images":1,"macros":1,"external_links":1,"defined_names":151,"comments":6,"pivot_tables":0},"unopened":[],"bounds":{"document_bytes":16777216,"sheet_cells":100000,"rows_first":2000,"rows_last":500,"rows_between":2000,"halvings":0,"cell_chars":16384,"cell_head_chars":4096},"cells_cut":0,"cells_raw":0,"read":"whole","date_system":"1900"}

{"sheet":"Startseite","index":0,"n_rows":54,"n_cols":4,"rows_kept":54,"cut":false,"hidden":false,"merged":[]}
[]
[null,null,null,"Hilfe zur Berechnung von Einkommen und Ausgaben eines"]
[null,null,null,"nordmärkischen Lehens"]
[]
[]
[]
[]
[]
[]
[]
[]
[]
[]
[]
[]
[]
[]
[]
[]
[]
{"$rows_left_out":35}
{"sheet":"Würfe","index":1,"n_rows":37,"n_cols":6,"rows_kept":37,"cut":false,"hidden":false,"merged":[]}
[]
[]
[]
[null,null,null,null,"Hier sind vorab ein paar Würfelwürfe zu tätigen. Die Ergebnisse werden in der"]
[null,null,null,null,"späteren Berechnung gebraucht. Würfelt einfach und tragt die Ergebnisse der Reihe nach hier ein :"]
[]
[]
[null,null,"Würfel (W3)",3,"Würfel (W3)",1]
[null,null,"Würfel (W3)",2,"Würfel (W3)",1]
[]
[null,null,"Würfel (W6)",3,"Würfel (W6)",5]
[null,null,"Würfel (W6)",3]
[]
[null,null,"Würfel (W10)",8,"Würfel (W10)",9]
[null,null,"Würfel (W10)",8,"Würfel (W10)",1]
[]
[null,null,"Würfel (W20)",9,"Würfel (W20)",18]
[null,null,"Würfel (W20)",16,"Würfel (W20)",8]
[null,null,"Würfel (W20)",20,"Würfel (W20)",18]
[null,null,"Würfel (W20)",2,"Würfel (W20)",19]
{"$rows_left_out":18}
{"sheet":"Allgemeines","index":2,"n_rows":43,"n_cols":7,"rows_kept":43,"cut":false,"hidden":false,"merged":[]}
[]
[null,"I. Allgemeines :"]
[]
[null,"Name der Lehens:",null,null,null,null,{"$f":"IF(_JN_Census=1,IFERROR(VLOOKUP(_Nr&\"*\",_CensusTab,2,FALSE),\"\"),\"\")","v":""}]
[null,"Kennziffer :"]
[null,"Lehensträger:",null,null,null,null,{"$f":"IF(_JN_Census=1,IFERROR(VLOOKUP(_Nr&\"*\",_CensusTab,3,FALSE),\"\"),\"\")","v":""}]
[null,null,"TaW Staatskunst:"]
[null,null,"TaW Feilschen:"]
[null,null,"TaW Rechnen:"]
[]
[null,"Daten aus dem Census verwenden?",null,2,null,null,"Hinweis :"]
[]
[null,"Handelt es sich um ein Edlen-, Junkergut, o.ä.?",null,2,null,null,"Im Feld Bevölkerungszahl erscheint die"]
[null,null,null,null,null,null,"nach den Regeln korrekt errechnete"]
[null,"Stadt > 1000 Einwohner im Lehen?",null,2,null,null,"Bevölkerung Eures Lehens, es kann "]
[null,"Stadt > 4000 Einwohner im Lehen?",null,2,null,null,"jedoch sein das die Zahl einem Baron"]
[null,"Schiffbarer Fluss oder See im Lehen?",null,2,null,null,"zu hoch ist. In diesem Fall ist die "]
[null,"Führt eine Reichsstrasse durch das Lehen?",null,2,null,null,"errechnete Zahl die maximal Ober-"]
[null,"Führt eine wichtige Passstrasse durch das Lehen?",null,2,null,null,"grenze und darf nach unten, aber "]
[null,"Liegt das Lehen an einer Provinzgrenze?",null,2,null,null,"nur nach unten angepaßt werden!"]
{"$rows_left_out":24}
{"sheet":"Einnahmen","index":3,"n_rows":24,"n_cols":7,"rows_kept":24,"cut":false,"hidden":false,"merged":[]}
[]
[null,"II. Einnahmen pro Jahr in Dukaten:"]
[]
[null,"a:",null,null,"e:"]
[null,"Erträge der Höfe:",null,null,"Einkünfte der eigenen Domäne:"]
[1,"Kleiner Hof:",{"$f":"_AnzBauerKl*INDEX(_Hoftyp,9,A6)","v":720},null,null,null,{"$f":"ROUND((_Einwohner/10-(_AnzEdel-1)*50)*(_W03_1+4),_RundGeld)","v":1050}]
[2,"Mittlerer Hof:",{"$f":"_AnzBauerMi*INDEX(_Hoftyp,9,A7)","v":540}]
[3,"Großer Hof:",{"$f":"_AnzBauerGr*INDEX(_Hoftyp,9,A8)","v":300}]
[4,"Gutshof:",{"$f":"_AnzBauerGu*INDEX(_Hoftyp,9,A9)","v":300},null,"f:"]
[5,"Hirtenstellen:",{"$f":"_AnzBauerHi*INDEX(_Hoftyp,9,A10)","v":600},null,"Bannergeld:"]
[6,"Waldbauernhof:",{"$f":"_AnzBauerWa*INDEX(_Hoftyp,9,A11)","v":980},null,null,null,{"$f":"CHOOSE(_JN_Edle,0,ROUND((_Einwohner*2%+_AnzBauerGr+_AnzBauerGu)*4,_RundGeld))","v":132}]
[null,null,{"$f":"SUM(C6:C11)","v":3440}]
[]
[null,"b:",null,null,"g:"]
[null,"Das Sterbegeld:",null,null,"Sonstige Steuern:"]
[null,null,{"$f":"ROUND(_Einwohner/100*(_W20_1+_W20_2+_W20_3),_RundGeld)","v":645},null,null,null,{"$f":"ROUND(_X_Faktor*CHOOSE(_JN_Edle,0.5,1)*_Einwohner*(100%-90%*_BauernAnteil)+(_TaW_Sk+_TaW_Feil+_TaW_Rechn)*(_W06_2+1)*10,_RundGeld)","v":420}]
[]
[null,"c:",null,null,"h:"]
[null,"Weingeld:",null,null,"Zölle wenn Lehen an Provinzgrenze:"]
[null,null,{"$f":"ROUND(_Einwohner/100*(_W20_4+_W20_5),_RundGeld)","v":420},null,null,null,{"$f":"CHOOSE(_JN_Edle,0,ROUND(_X_Zoll*_Einwohner*(100%-90%*_BauernAnteil),_RundGeld))","v":0}]
{"$rows_left_out":5}
{"sheet":"Ausgaben","index":4,"n_rows":19,"n_cols":8,"rows_kept":19,"cut":false,"hidden":false,"merged":[]}
[]
[null,"III. Feste Ausgaben des Lehens pro Jahr in Dukaten:"]
[]
[null,"a.",null,null,null,"d."]
[null,"Der Herzogentaler:",null,null,null,"Tempelzehnt:"]
[null,"(Einwohnerbasiert)",null,{"$f":"CHOOSE(_JN_Edle,0,ROUND(_Einwohner*_Herzogentaler,_RundGeld))","v":1950},null,null,null,{"$f":"ROUND(_Einnahmen*_ZehntTemp,_RundGeld)","v":638}]
[]
[]
[null,"b.",null,null,null,"e."]
[null,"Lehensabgaben:",null,null,null,"Kredite:"]
[null,"Grafenzehnt:",null,{"$f":"ROUND(_Einnahmen*_ZehntGraf*CHOOSE(_JN_Edle,2,1),_RundGeld)","v":638},null,"Abtragung :"]
[null,"Herzogenzehnt:",null,{"$f":"ROUND(_Einnahmen*_ZehntHerz*CHOOSE(_JN_Edle,2,1),_RundGeld)","v":638}]
[null,null,null,{"$f":"SUM(D11:D12)","v":1276}]
[]
[null,"c."]
[null,"Zollabgaben:"]
[null,"Grafenanteil:",null,{"$f":"ROUND(_EinnahmeZoll*_ZollGraf,_RundGeld)","v":0},null,"Summe der festen Ausgaben"]
[null,"Herzogenanteil:",null,{"$f":"ROUND(_EinnahmeZoll*_ZollHerz,_RundGeld)","v":0},null,{"$f":"_AusgabeHerz+_AusgabeLehen+_AusgabeZoll+_AusgabeTemp+_AusgabeKredit","v":3864},"Dukaten"]
[null,null,null,{"$f":"SUM(D17:D18)","v":0}]

{"sheet":"Unterhalt","index":5,"n_rows":54,"n_cols":8,"rows_kept":54,"cut":false,"hidden":false,"merged":[]}
[]
[null,"IV. laufende Unterhaltung des Lehens"]
[]
[null,"a.",null,null,null,"b."]
[null,"Burgen:","Anzahl:","Unterhaltung:",null,"Straßen:","Anzahl Meilen: ","Unterhaltung:"]
[1,"große Burg",1,{"$f":"ROUND((_AnzGrBurg-1)*INDEX(_UnterhaltListe,$A6)*_W03_2/10,_RundGeld)","v":0},null,"Reichsstraße",null,{"$f":"ROUND((_W20_7+_W20_8+_W20_9+_W20_10)*_MeileRS/10,_RundGeld)","v":0}]
[2,"mittlere Burg",1,{"$f":"ROUND((_AnzMiBurg-1)*INDEX(_UnterhaltListe,$A7)*_W03_2/10,_RundGeld)","v":0},null,"Hauptstraße",null,{"$f":"ROUND((_W20_11+_W20_12)*_MeileHS/10,_RundGeld)","v":0}]
[3,"kleine Burg",1,{"$f":"ROUND((_AnzKlBurg-1)*INDEX(_UnterhaltListe,$A8)*_W03_2/10,_RundGeld)","v":0},null,"Nebenwege",null,{"$f":"ROUND((_W20_13)*_MeileNW/10,_RundGeld)","v":0}]
[null,null,null,{"$f":"SUM(D6:D8)","v":0},null,"Karrenwege",null,{"$f":"ROUND((_W10_1)*_MeileKW/10,_RundGeld)","v":0}]
[null,null,null,null,null,null,null,{"$f":"SUM(H6:H9)","v":0}]
[]
[null,"c.",null,null,null,"d."]
[null,"Brücken:","Anzahl Schritt:","Unterhaltung:",null,"restliche Infrastruktur :"]
[null,"Holzbrücke",null,{"$f":"ROUND((_W10_2+_W10_3)*_SchrittHBrü/10,_RundGeld)","v":0},null,null,null,{"$f":"INDEX(_InfraListe,_BesiedDD)","v":204}]
[null,"Steinrücke",null,{"$f":"ROUND((_W20_14+_W20_15)*_SchrittSBrü/10,_RundGeld)","v":0}]
[null,"Fährschloß",null,{"$f":"ROUND((_W20_16+_W20_17)*_SchrittFährSchl/10,_RundGeld)","v":0},null,"e."]
[null,"Fährschiff",null,{"$f":"ROUND((_W20_18+_W20_19+_W20_20)*_SchrittFähre/10,_RundGeld)","v":0},null,"Dotierungen:"]
[null,null,null,{"$f":"SUM(D14:D17)","v":0},null,null,null,{"$f":"ROUND(_Einwohner/10*_W03_4,_RundGeld)","v":150}]
[]
[null,"f."]
{"$rows_left_out":35}
{"sheet":"Bilanz","index":6,"n_rows":24,"n_cols":7,"rows_kept":24,"cut":false,"hidden":false,"merged":[]}
[]
[null,"V. Die Abschlußbilanz"]
[]
[null,null,"Einkünfte:",{"$f":"_Einnahmen","v":6377},"Dukaten"]
[null,"-","Ausgaben:",{"$f":"_Ausgaben","v":3864},"Dukaten"]
[null,"-","Unterhalt:",{"$f":"_Unterhalt","v":354},"Dukaten"]
[]
[null,null,"Zwischenergebnbis:",{"$f":"D4-D5-D6","v":2159},"Dukaten"]
[]
[null,"-","Rücklage",null,"Dukaten"]
[null,"-","Investitionen",null,"Dukaten"]
[null,"-","Privatschatulle",null,"Dukaten"]
[]
[null,"+","Kredit",null,"Dukaten"]
[null,"+","Entnahme aus Rücklage",null,"Dukaten"]
[]
[null,null,"Ergebnis :",{"$f":"D8-D10-D11-D12+D14+D15","v":2159},"Dukaten",null,{"$f":"IF(D17<>0,\"Achtung! Die Bilanz muss auf 0 aufgehen!\",\"\")","v":"Achtung! Die Bilanz muss auf 0 aufgehen!"}]
[]
[]
[]
{"$rows_left_out":5}
{"sheet":"Tabellen","index":7,"n_rows":36,"n_cols":39,"rows_kept":36,"cut":false,"hidden":false,"merged":[[0,19,1,19],[0,20,0,23],[0,24,1,24],[0,31,1,31],[0,33,0,36],[0,0,1,0],[0,27,0,29],[0,30,1,30],[0,6,0,11],[0,1,1,1],[0,2,1,2],[0,3,1,3],[0,4,1,4],[0,5,1,5],[0,25,0,26],[0,12,1,12],[0,13,0,18]]}
["Ja/Nein","Würfel","Region","Einwohner/Region","Besiedlungstyp","Auswirkungen Besiedlungstyp","Modifikation Einwohner (_W06_1)",null,null,null,null,null,"Anteil Bauern","Anteil Hoftyp",null,null,null,null,null,"Nachkomma Geld","Nachbarschaft",null,null,null,"Herzogen-taler (D)","Zehnte",null,"Unterhalt",null,null,"Infrastruktur","Einwohner Edlengut",null,"Beschreibung der Würfel",null,null,null,null,"Neu anzeigen?"]
[null,null,null,null,null,null,1,2,3,4,5,6,null,"Klein","Mittel","Groß","Gut","Hirten","Waldbauer",null,"Bedingung","Wert","Faktor","Ergebnis",null,"Typ","Wert","Index","Typ","Wert",null,null,null,"Würfel","akt. Wert","Formel","Zelle",null,false]
["ja",0,"Nördliches Gratenfels",1500,"Ödlande",0,0.1,0.05,0,-0.1,-0.2,-0.3,{"$f":"M5*(100%-M7)","v":0.8},0.4,0.15,0.05,0.03,0.25,0.12,0,"Basiswert",null,1,{"$f":"1","v":1},1.3,"Grafenzehnt",0.1,1,"große Burg",15000,{"$f":"_W20_21*_W20_22","v":204},0.1,null,"_W03_1",{"$f":"_W03_1","v":3},"III.E","Einnahmen'!$G$6"]
["nein",1,"Rest der Nordmarken",3800,"Wildlande",200,0.15,0.05,0,0,-0.05,-0.15,"Vorgabe",0.4,0.15,7.0000000000000007E-2,0.04,0.14000000000000001,0.2,null,"Stadt > 1000",{"$f":"_JN_1000=1","v":false},0.5,{"$f":"IF(V4,W4,0)","v":0},null,"Herzogenzehnt",0.1,2,"mittlere Burg",8000,{"$f":"_W20_21*(_W20_22+_W10_4)","v":221},null,null,"_W03_2",{"$f":"_W03_2","v":1},"V.A","Unterhalt'!$K$6"]
[null,2,null,null,"Grenzungen",400,0.2,0.1,0,0,-0.05,-0.1,0.8,0.35,0.23,0.1,0.05,0.12,0.15,null,"Stadt > 4000",{"$f":"_JN_4000=1","v":false},1,0,null,"Tempelzehnt",0.1,3,"kleine Burg",4000,{"$f":"_W20_21*(_W20_22+_W20_23)","v":544},null,null,"_W03_3",{"$f":"_W03_3","v":2},"V.C","_InfraListe"]
[null,3,"Nördliche Baronien",1500,"Mischlande",600,0.2,0.15,0.1,0,0,-0.1,"Anteil Zw.",0.3,0.3,0.15,7.0000000000000007E-2,0.1,0.08,null,"Fluss/See",{"$f":"_JN_Fluss=1","v":false},0.5,0,null,"Grafenanteil Zoll",0.25,4,"Verwalter",250,{"$f":"_W20_21*(_W20_22+_W20_23+_W10_4)","v":561},null,null,"_W03_4",{"$f":"_W03_4","v":1},"V.E","Unterhalt'!$H$18"]
[null,4,"Mittelländische Baronien",3800,"Wohlpflegende",800,0.25,0.15,0.1,0.05,0,-0.1,{"$f":"IF(_JN_Census=1,IFERROR(VLOOKUP(_Nr&\"*\",_CensusTab,7,FALSE),0),0)","v":0},0.3,0.3,0.2,0.1,0.05,0.05,null,"Besiedlungstyp",{"$f":"_BesiedDD>=5","v":false},0.5,0,null,"Herzogenanteil Zoll",0.25,5,"Haushofmeister",150,{"$f":"_W20_21*(+_W20_22+_W20_23)*_W03_3","v":1088},null,null,"_W06_1",{"$f":"_W06_1","v":3},"II.C","Allgemeines'!$D$23"]
[null,5,"Südliche Baronien",5000,"Kulturlande",1000,0.3,0.2,0.1,0.05,0,-0.05,null,0.3,0.25,0.25,0.15,0.05,0,null,"Reichsstr.",{"$f":"_JN_Reich=1","v":false},0.5,0,null,null,null,6,"Waibel",120,{"$f":"_W20_21*(+_W20_22+_W20_23)*_W06_3","v":1632},null,null,"_W06_2",{"$f":"_W06_2","v":5},"III.G","Einnahmen'!$G$16"]
[null,6,null,null,null,null,null,null,null,null,null,null,"Bewohner",10,20,30,40,10,10,null,"Passstr.",{"$f":"_JN_Pass=1","v":false},0.5,0,null,null,null,7,"Korporal",80,null,null,null,"_W06_3",{"$f":"_W06_3","v":3},"V.C","_InfraListe"]
[null,7,null,null,null,null,null,null,null,null,null,null,"Land",4,20,70,120,3,3,null,null,null,"X:",{"$f":"SUM(X3:X9)","v":1},null,null,null,8,"Büttel",60,null,null,null,"_W10_1",{"$f":"_W10_1","v":8},"V.B","Unterhalt'!$H$9"]
[null,8,null,null,null,null,null,null,null,null,null,null,"Einnahmen",15,60,150,300,20,70,null,"Grenze",{"$f":"_JN_Grenze=1","v":false},0.5,{"$f":"IF(V11,W11,0)","v":0},null,null,null,9,"Reitknecht",50,null,null,null,"_W10_2",{"$f":"_W10_2","v":9},"V.B","Unterhalt'!$D$14"]
[null,9,null,null,null,null,null,null,null,null,null,null,null,null,null,null,null,null,null,null,null,null,null,null,null,null,null,10,"Page",30,null,null,null,"_W10_3",{"$f":"_W10_3","v":8},"V.B","Unterhalt'!$D$14"]
[null,10,null,null,null,null,null,null,null,null,null,null,null,null,null,null,null,null,null,null,null,null,null,null,null,null,null,11,"Pferd (Warunker)",40,null,null,null,"_W10_4",{"$f":"_W10_4","v":1},"V.C","_InfraListe"]
[null,11,null,null,null,null,null,null,null,null,null,null,null,null,null,null,null,null,null,null,null,null,null,null,null,null,null,12,"Pferd (Elenviner Vollblut)",80,null,null,null,"_W20_1",{"$f":"_W20_1","v":9},"III.B","Einnahmen'!$C$16"]
[null,12,null,null,null,null,null,null,null,null,null,null,null,null,null,null,null,null,null,null,null,null,null,null,null,null,null,13,"Zugochse",25,null,null,null,"_W20_2",{"$f":"_W20_2","v":18},"III.B","Einnahmen'!$C$16"]
[null,13,null,null,null,null,null,null,null,null,null,null,null,null,null,null,null,null,null,null,null,null,null,null,null,null,null,14,"Maultier",15,null,null,null,"_W20_3",{"$f":"_W20_3","v":16},"III.B","Einnahmen'!$C$16"]
[null,14,null,null,null,null,null,null,null,null,null,null,null,null,null,null,null,null,null,null,null,null,null,null,null,null,null,15,"Muli",15,null,null,null,"_W20_4",{"$f":"_W20_4","v":8},"III.C","Einnahmen'!$C$20"]
[null,15,null,null,null,null,null,null,null,null,null,null,null,null,null,null,null,null,null,null,null,null,null,null,null,null,null,16,"Esel",10,null,null,null,"_W20_5",{"$f":"_W20_5","v":20},"III.C","Einnahmen'!$C$20"]
[null,16,null,null,null,null,null,null,null,null,null,null,null,null,null,null,null,null,null,null,null,null,null,null,null,null,null,17,"Wehrheimer Dogge",30,null,null,null,"_W20_6",{"$f":"_W20_6","v":18},"III.D","Einnahmen'!$C$24"]
[null,17,null,null,null,null,null,null,null,null,null,null,null,null,null,null,null,null,null,null,null,null,null,null,null,null,null,18,"ThorwalerWindhund",10,null,null,null,"_W20_7",{"$f":"_W20_7","v":2},"V.B","Unterhalt'!$H$6"]
{"$rows_left_out":17}
{"sheet":"Census","index":8,"n_rows":329,"n_cols":9,"rows_kept":329,"cut":false,"hidden":false,"merged":[]}
["Formeln",{"$f":"IF(OR(A1=\"\",A1=\"-\"),\"\",IFERROR(VLOOKUP($A1,[1]Tabelle2!$A:$I,B$2,FALSE),\"\"))","v":""},{"$f":"IF(OR(B1=\"\",B1=\"-\"),\"\",IFERROR(VLOOKUP($A1,[1]Tabelle2!$A:$I,C$2,FALSE),\"\"))","v":""},{"$f":"IF(OR(C1=\"\",C1=\"-\"),\"\",IFERROR(VLOOKUP($A1,[1]Tabelle2!$A:$I,D$2,FALSE),\"\"))","v":""},{"$f":"IF(OR(D1=\"\",D1=\"-\"),\"\",IFERROR(VLOOKUP($A1,[1]Tabelle2!$A:$I,E$2,FALSE),\"\"))","v":""},{"$f":"IFERROR(D1+E1,\"\")","v":""},{"$f":"IFERROR(E1/F1,\"\")","v":""},null,"Stand: Census_Nordmarken_20200717b"]
[null,2,3,4,9]
["Nr.","Lehen","Lehensherr","Menschen","Zwerge","Gesamt","% Zwerge"]
["NOR  ",{"$f":"IF(OR(A4=\"\",A4=\"-\"),\"\",IFERROR(VLOOKUP($A4,[1]Tabelle2!$A:$I,B$2,FALSE),\"\"))","v":"Herzogtum Nordmarken"},{"$f":"IF(OR(B4=\"\",B4=\"-\"),\"\",IFERROR(VLOOKUP($A4,[1]Tabelle2!$A:$I,C$2,FALSE),\"\"))","v":"Herzog Hagrobald Guntwin vom Großen Fluß"},{"$f":"IF(OR(C4=\"\",C4=\"-\"),\"\",IFERROR(VLOOKUP($A4,[1]Tabelle2!$A:$I,D$2,FALSE),\"\"))","v":240000},{"$f":"IF(OR(D4=\"\",D4=\"-\"),\"\",IFERROR(VLOOKUP($A4,[1]Tabelle2!$A:$I,E$2,FALSE),\"\"))","v":10715},{"$f":"IFERROR(D4+E4,\"\")","v":250715},{"$f":"IFERROR(E4/F4,\"\")","v":4.2737769977863313E-2},null,"Hinweis :"]
["Nor-IP ",{"$f":"IF(OR(A5=\"\",A5=\"-\"),\"\",IFERROR(VLOOKUP($A5,[1]Tabelle2!$A:$I,B$2,FALSE),\"\"))","v":"Stadtmark Elenvina "},{"$f":"IF(OR(B5=\"\",B5=\"-\"),\"\",IFERROR(VLOOKUP($A5,[1]Tabelle2!$A:$I,C$2,FALSE),\"\"))","v":"Graf Frankwart vom Großen Fluß"},{"$f":"IF(OR(C5=\"\",C5=\"-\"),\"\",IFERROR(VLOOKUP($A5,[1]Tabelle2!$A:$I,D$2,FALSE),\"\"))","v":46000},{"$f":"IF(OR(D5=\"\",D5=\"-\"),\"\",IFERROR(VLOOKUP($A5,[1]Tabelle2!$A:$I,E$2,FALSE),\"\"))","v":500},46500,{"$f":"IFERROR(E5/F5,\"\")","v":1.0752688172043012E-2}]
["Nor-I-01",{"$f":"IF(OR(A6=\"\",A6=\"-\"),\"\",IFERROR(VLOOKUP($A6,[1]Tabelle2!$A:$I,B$2,FALSE),\"\"))","v":"Stadtmark Elenvina "},{"$f":"IF(OR(B6=\"\",B6=\"-\"),\"\",IFERROR(VLOOKUP($A6,[1]Tabelle2!$A:$I,C$2,FALSE),\"\"))","v":"Vogt Markward von Brüllenfels-Schleiffenröchte"},{"$f":"IF(OR(C6=\"\",C6=\"-\"),\"\",IFERROR(VLOOKUP($A6,[1]Tabelle2!$A:$I,D$2,FALSE),\"\"))","v":0},{"$f":"IF(OR(D6=\"\",D6=\"-\"),\"\",IFERROR(VLOOKUP($A6,[1]Tabelle2!$A:$I,E$2,FALSE),\"\"))","v":0},0,"",null,"Um nicht mit falschen Referenzen zu arbeiten, sind die Bezüge nur"]
["Nor-I-01P",{"$f":"IF(OR(A7=\"\",A7=\"-\"),\"\",IFERROR(VLOOKUP($A7,[1]Tabelle2!$A:$I,B$2,FALSE),\"\"))","v":"Ratslande Klippag"},{"$f":"IF(OR(B7=\"\",B7=\"-\"),\"\",IFERROR(VLOOKUP($A7,[1]Tabelle2!$A:$I,C$2,FALSE),\"\"))","v":"Baronin Idra ni Bennain von Elenvina, vertreten durch Ratsvogt Radulf von Elenvina"},{"$f":"IF(OR(C7=\"\",C7=\"-\"),\"\",IFERROR(VLOOKUP($A7,[1]Tabelle2!$A:$I,D$2,FALSE),\"\"))","v":30100},{"$f":"IF(OR(D7=\"\",D7=\"-\"),\"\",IFERROR(VLOOKUP($A7,[1]Tabelle2!$A:$I,E$2,FALSE),\"\"))","v":200},30300,6.6006600660066007E-3,null,"Werte."]
["Nor-I-01-1P",{"$f":"IF(OR(A8=\"\",A8=\"-\"),\"\",IFERROR(VLOOKUP($A8,[1]Tabelle2!$A:$I,B$2,FALSE),\"\"))","v":"Herzogenstadt Elenvina"},{"$f":"IF(OR(B8=\"\",B8=\"-\"),\"\",IFERROR(VLOOKUP($A8,[1]Tabelle2!$A:$I,C$2,FALSE),\"\"))","v":"Herzog Hagrobald Guntwin vom Großen Flußvertreten, vertreten durch Vogt Ardo von Plötzbogen"},{"$f":"IF(OR(C8=\"\",C8=\"-\"),\"\",IFERROR(VLOOKUP($A8,[1]Tabelle2!$A:$I,D$2,FALSE),\"\"))","v":12300},{"$f":"IF(OR(D8=\"\",D8=\"-\"),\"\",IFERROR(VLOOKUP($A8,[1]Tabelle2!$A:$I,E$2,FALSE),\"\"))","v":200},12500,1.6E-2,null,"Zur Aktualisierung:"]
["Nor-I-01-P2",{"$f":"IF(OR(A9=\"\",A9=\"-\"),\"\",IFERROR(VLOOKUP($A9,[1]Tabelle2!$A:$I,B$2,FALSE),\"\"))","v":"Ratsland Klippag"},{"$f":"IF(OR(B9=\"\",B9=\"-\"),\"\",IFERROR(VLOOKUP($A9,[1]Tabelle2!$A:$I,C$2,FALSE),\"\"))","v":"Baronin Idra ni Bennain von Elenvina, vertreten durch Ratsvogt Radulf von Elenvina"},{"$f":"IF(OR(C9=\"\",C9=\"-\"),\"\",IFERROR(VLOOKUP($A9,[1]Tabelle2!$A:$I,D$2,FALSE),\"\"))","v":1860},{"$f":"IF(OR(D9=\"\",D9=\"-\"),\"\",IFERROR(VLOOKUP($A9,[1]Tabelle2!$A:$I,E$2,FALSE),\"\"))","v":0},1860,0,null,"- Den Bezug zur aktuellen Version des Censuns über \"Daten\" ->"]
["-",{"$f":"IF(OR(A10=\"\",A10=\"-\"),\"\",IFERROR(VLOOKUP($A10,[1]Tabelle2!$A:$I,B$2,FALSE),\"\"))","v":""},{"$f":"IF(OR(B10=\"\",B10=\"-\"),\"\",IFERROR(VLOOKUP($A10,[1]Tabelle2!$A:$I,C$2,FALSE),\"\"))","v":""},{"$f":"IF(OR(C10=\"\",C10=\"-\"),\"\",IFERROR(VLOOKUP($A10,[1]Tabelle2!$A:$I,D$2,FALSE),\"\"))","v":""},{"$f":"IF(OR(D10=\"\",D10=\"-\"),\"\",IFERROR(VLOOKUP($A10,[1]Tabelle2!$A:$I,E$2,FALSE),\"\"))","v":""},"","",null,"\"Verknüpfungen bearbeiten\" herstellen"]
["Nor-I-01-E1",{"$f":"IF(OR(A11=\"\",A11=\"-\"),\"\",IFERROR(VLOOKUP($A11,[1]Tabelle2!$A:$I,B$2,FALSE),\"\"))","v":"Edlengut Furtland"},{"$f":"IF(OR(B11=\"\",B11=\"-\"),\"\",IFERROR(VLOOKUP($A11,[1]Tabelle2!$A:$I,C$2,FALSE),\"\"))","v":"xxx"},{"$f":"IF(OR(C11=\"\",C11=\"-\"),\"\",IFERROR(VLOOKUP($A11,[1]Tabelle2!$A:$I,D$2,FALSE),\"\"))","v":0},{"$f":"IF(OR(D11=\"\",D11=\"-\"),\"\",IFERROR(VLOOKUP($A11,[1]Tabelle2!$A:$I,E$2,FALSE),\"\"))","v":0},0,"",null,"- Die Nr. in Spalte A aus dem aktuellen Census kopieren"]
["Nor-I-01-E2",{"$f":"IF(OR(A12=\"\",A12=\"-\"),\"\",IFERROR(VLOOKUP($A12,[1]Tabelle2!$A:$I,B$2,FALSE),\"\"))","v":"Edlengut Hahnland"},{"$f":"IF(OR(B12=\"\",B12=\"-\"),\"\",IFERROR(VLOOKUP($A12,[1]Tabelle2!$A:$I,C$2,FALSE),\"\"))","v":"xxx"},{"$f":"IF(OR(C12=\"\",C12=\"-\"),\"\",IFERROR(VLOOKUP($A12,[1]Tabelle2!$A:$I,D$2,FALSE),\"\"))","v":0},{"$f":"IF(OR(D12=\"\",D12=\"-\"),\"\",IFERROR(VLOOKUP($A12,[1]Tabelle2!$A:$I,E$2,FALSE),\"\"))","v":0},0,"",null,"- Die Formeln aus B1:F1 hinter die Nummern kopieren"]
["Nor-I-01-E3",{"$f":"IF(OR(A13=\"\",A13=\"-\"),\"\",IFERROR(VLOOKUP($A13,[1]Tabelle2!$A:$I,B$2,FALSE),\"\"))","v":"Edlengut Forstland"},{"$f":"IF(OR(B13=\"\",B13=\"-\"),\"\",IFERROR(VLOOKUP($A13,[1]Tabelle2!$A:$I,C$2,FALSE),\"\"))","v":"xxx"},{"$f":"IF(OR(C13=\"\",C13=\"-\"),\"\",IFERROR(VLOOKUP($A13,[1]Tabelle2!$A:$I,D$2,FALSE),\"\"))","v":0},{"$f":"IF(OR(D13=\"\",D13=\"-\"),\"\",IFERROR(VLOOKUP($A13,[1]Tabelle2!$A:$I,E$2,FALSE),\"\"))","v":0},0,"",null,"- Alle Formeln in B4:Fxxx durch Werte ersetzen"]
["Nor-I-01-E4",{"$f":"IF(OR(A14=\"\",A14=\"-\"),\"\",IFERROR(VLOOKUP($A14,[1]Tabelle2!$A:$I,B$2,FALSE),\"\"))","v":"Edlengut Stiefelstieg"},{"$f":"IF(OR(B14=\"\",B14=\"-\"),\"\",IFERROR(VLOOKUP($A14,[1]Tabelle2!$A:$I,C$2,FALSE),\"\"))","v":"Edler Randoald von Zweibruckenburg"},{"$f":"IF(OR(C14=\"\",C14=\"-\"),\"\",IFERROR(VLOOKUP($A14,[1]Tabelle2!$A:$I,D$2,FALSE),\"\"))","v":0},{"$f":"IF(OR(D14=\"\",D14=\"-\"),\"\",IFERROR(VLOOKUP($A14,[1]Tabelle2!$A:$I,E$2,FALSE),\"\"))","v":0},0,""]
["Nor-I-01-E5",{"$f":"IF(OR(A15=\"\",A15=\"-\"),\"\",IFERROR(VLOOKUP($A15,[1]Tabelle2!$A:$I,B$2,FALSE),\"\"))","v":"Edlengut Wachtland"},{"$f":"IF(OR(B15=\"\",B15=\"-\"),\"\",IFERROR(VLOOKUP($A15,[1]Tabelle2!$A:$I,C$2,FALSE),\"\"))","v":"xxx"},{"$f":"IF(OR(C15=\"\",C15=\"-\"),\"\",IFERROR(VLOOKUP($A15,[1]Tabelle2!$A:$I,D$2,FALSE),\"\"))","v":0},{"$f":"IF(OR(D15=\"\",D15=\"-\"),\"\",IFERROR(VLOOKUP($A15,[1]Tabelle2!$A:$I,E$2,FALSE),\"\"))","v":0},0,""]
["Nor-I-01-E6",{"$f":"IF(OR(A16=\"\",A16=\"-\"),\"\",IFERROR(VLOOKUP($A16,[1]Tabelle2!$A:$I,B$2,FALSE),\"\"))","v":"Edlengut Wogenland"},{"$f":"IF(OR(B16=\"\",B16=\"-\"),\"\",IFERROR(VLOOKUP($A16,[1]Tabelle2!$A:$I,C$2,FALSE),\"\"))","v":"xxx"},{"$f":"IF(OR(C16=\"\",C16=\"-\"),\"\",IFERROR(VLOOKUP($A16,[1]Tabelle2!$A:$I,D$2,FALSE),\"\"))","v":0},{"$f":"IF(OR(D16=\"\",D16=\"-\"),\"\",IFERROR(VLOOKUP($A16,[1]Tabelle2!$A:$I,E$2,FALSE),\"\"))","v":0},0,""]
["Nor-I-01-J1",{"$f":"IF(OR(A17=\"\",A17=\"-\"),\"\",IFERROR(VLOOKUP($A17,[1]Tabelle2!$A:$I,B$2,FALSE),\"\"))","v":"Junkergut Herrnburg"},{"$f":"IF(OR(B17=\"\",B17=\"-\"),\"\",IFERROR(VLOOKUP($A17,[1]Tabelle2!$A:$I,C$2,FALSE),\"\"))","v":"Junkerin Bilhild Ulfahan von Herrnburg"},{"$f":"IF(OR(C17=\"\",C17=\"-\"),\"\",IFERROR(VLOOKUP($A17,[1]Tabelle2!$A:$I,D$2,FALSE),\"\"))","v":0},{"$f":"IF(OR(D17=\"\",D17=\"-\"),\"\",IFERROR(VLOOKUP($A17,[1]Tabelle2!$A:$I,E$2,FALSE),\"\"))","v":0},0,""]
["Nor-I-02P",{"$f":"IF(OR(A18=\"\",A18=\"-\"),\"\",IFERROR(VLOOKUP($A18,[1]Tabelle2!$A:$I,B$2,FALSE),\"\"))","v":"Herzöglich Fuchsgau "},{"$f":"IF(OR(B18=\"\",B18=\"-\"),\"\",IFERROR(VLOOKUP($A18,[1]Tabelle2!$A:$I,C$2,FALSE),\"\"))","v":"Baron Hagrobald Guntwin vom Großen Fluss, vertreten durch Vogt Leodegram von Starkenrast"},{"$f":"IF(OR(C18=\"\",C18=\"-\"),\"\",IFERROR(VLOOKUP($A18,[1]Tabelle2!$A:$I,D$2,FALSE),\"\"))","v":10200},{"$f":"IF(OR(D18=\"\",D18=\"-\"),\"\",IFERROR(VLOOKUP($A18,[1]Tabelle2!$A:$I,E$2,FALSE),\"\"))","v":50},10250,4.8780487804878049E-3]
["Nor-I-02P-E1",{"$f":"IF(OR(A19=\"\",A19=\"-\"),\"\",IFERROR(VLOOKUP($A19,[1]Tabelle2!$A:$I,B$2,FALSE),\"\"))","v":"Edlengut Fuchshag"},{"$f":"IF(OR(B19=\"\",B19=\"-\"),\"\",IFERROR(VLOOKUP($A19,[1]Tabelle2!$A:$I,C$2,FALSE),\"\"))","v":"Edler Onjaro von Fuchshag"},{"$f":"IF(OR(C19=\"\",C19=\"-\"),\"\",IFERROR(VLOOKUP($A19,[1]Tabelle2!$A:$I,D$2,FALSE),\"\"))","v":0},{"$f":"IF(OR(D19=\"\",D19=\"-\"),\"\",IFERROR(VLOOKUP($A19,[1]Tabelle2!$A:$I,E$2,FALSE),\"\"))","v":0},0,""]
["Nor-I-02P-E2",{"$f":"IF(OR(A20=\"\",A20=\"-\"),\"\",IFERROR(VLOOKUP($A20,[1]Tabelle2!$A:$I,B$2,FALSE),\"\"))","v":"Burg Grötz"},{"$f":"IF(OR(B20=\"\",B20=\"-\"),\"\",IFERROR(VLOOKUP($A20,[1]Tabelle2!$A:$I,C$2,FALSE),\"\"))","v":"Leodegram von Starkenrast"},{"$f":"IF(OR(C20=\"\",C20=\"-\"),\"\",IFERROR(VLOOKUP($A20,[1]Tabelle2!$A:$I,D$2,FALSE),\"\"))","v":0},{"$f":"IF(OR(D20=\"\",D20=\"-\"),\"\",IFERROR(VLOOKUP($A20,[1]Tabelle2!$A:$I,E$2,FALSE),\"\"))","v":0},0,""]
{"$rows_left_out":310}
{"sheet":"Modul1","index":9,"n_rows":0,"n_cols":0,"rows_kept":0,"cut":false,"hidden":true,"merged":[]}